program: Gaussian 09
title: 000068059
version: EM64L-G09RevD.01
frameworkgroup: C1[X(C28H12N2O2)]
method: RPBEPBE
basis: SDD
operation: Freq
keyword: #p
keyword: freq=noraman
keyword: PBEPBE/SDD
title: #p freq=noraman PBEPBE/SDD
converged: YES YES YES YES
title: Mulliken charges:
elementType: O O N N C C C C C C C C C C C C C C C C C C C C C C C C C C C C H H H H H H H H H H H H
charge: -0.178379 -0.178379 0.018512 0.018512 0.248974 0.248974 0.212824 0.212824 -0.339484 -0.339486 -0.082725 -0.082723 0.294158 0.294161 0.397671 0.397671 0.249537 0.249536 -0.341486 -0.341486 -0.396766 -0.396767 -0.457793 -0.457793 -0.399084 -0.399084 -0.398563 -0.398563 -0.228450 -0.228449 -0.235595 -0.235594 0.271910 0.271910 0.297285 0.297285 0.294040 0.294040 0.294430 0.294430 0.238318 0.238318 0.240664 0.240664
chargesum: 0.00000
title: Mulliken charges with hydrogens summed into heavy atoms:
elementType: O O N N C C C C C C C C C C C C C C C C C C C C C C C C C C C C
charge: -0.178379 -0.178379 0.018512 0.018512 0.248974 0.248974 0.212824 0.212824 -0.339484 -0.339486 -0.082725 -0.082723 0.294158 0.294161 0.397671 0.397671 0.249537 0.249536 -0.069575 -0.069576 -0.396766 -0.396767 -0.160508 -0.160508 -0.105044 -0.105045 -0.104133 -0.104133 0.009868 0.009869 0.005069 0.005069
polarizability: 7.36962423e+02 3.02013917e+01 3.90621570e+02 1.28609373e-02 -1.45305794e-03 1.12924725e+02
1716.lowfreq: -5.8997 -5.1476 -0.0007 0.0003 0.0008 6.8159 29.9390 47.1316 65.5516
frequency: 29.9390 47.1316 65.5512 96.4431 118.8958 124.9482 134.5462 142.5839 189.9057 197.8827 211.5905 243.1352 262.6349 274.5113 300.8745 323.6341 346.2951 352.4232 359.5087 359.5486 403.1499 428.4349 428.5196 438.4741 442.9749 453.8355 479.8744 493.0460 499.6260 518.2336 523.4690 539.6240 575.3749 582.1179 595.8744 619.1985 631.7923 648.4276 658.8983 684.9058 686.6083 703.9189 704.9888 729.1576 740.3689 743.2275 756.6828 790.3642 794.5917 805.2468 810.6611 814.5548 860.0280 873.5450 882.5634 887.4603 895.0769 896.9095 924.4206 953.8099 955.5917 987.0704 994.1189 998.6124 998.8860 1011.3249 1011.9708 1016.6746 1016.8179 1035.2956 1037.7912 1084.8822 1085.1173 1094.6988 1103.9023 1154.6483 1162.0452 1168.5140 1169.6368 1177.2828 1184.1192 1215.2629 1241.1906 1264.6394 1278.5765 1287.7516 1299.3545 1316.4449 1324.8947 1355.5102 1365.7061 1381.9192 1394.1613 1394.8135 1413.9039 1430.7883 1431.9975 1442.9255 1447.9684 1461.0338 1469.6356 1475.4472 1488.8391 1505.4911 1521.6988 1540.5399 1556.1966 1571.5227 1572.5471 1589.4505 1603.9471 1606.2830 1612.2168 1617.4836 3136.6749 3136.6830 3152.1596 3152.1903 3153.6675 3153.7989 3165.2923 3165.3108 3171.9830 3172.0613 3174.9934 3175.0718
redmass: 6.1157 8.4598 7.3185 5.1311 5.0615 6.0588 4.6725 6.4518 5.8938 7.0854 7.6615 5.7192 7.9568 5.5391 7.4851 9.7336 5.9732 5.8058 8.9198 6.9743 5.9551 8.4726 3.5196 3.7248 5.3772 8.3988 4.1404 4.4809 7.8432 11.4653 8.1265 5.0436 4.2559 8.1827 5.2874 7.1615 7.2152 7.0518 8.2146 4.7850 7.2016 3.3305 8.2565 2.6560 3.4649 6.2778 4.0801 7.6914 2.0730 1.8420 7.7573 2.4080 1.7922 2.3126 8.4536 6.7880 1.5613 1.5947 7.9704 2.5977 2.6414 6.0201 5.0219 1.3874 1.3903 1.4037 1.3966 1.4267 1.4296 2.1337 1.9755 3.2038 2.7169 1.8012 2.1896 1.6660 1.8748 1.7452 1.1848 1.7980 1.9355 1.8157 1.7591 1.8636 2.0580 3.0975 2.8208 6.2631 5.7445 4.0098 6.7259 7.1243 10.0804 9.5626 3.2420 3.7647 5.8329 5.5142 3.5512 4.2077 3.1055 3.1808 4.8923 6.0748 8.4991 8.8903 7.4604 7.4859 7.3378 7.8024 9.3854 8.5269 7.0382 7.9296 1.0864 1.0864 1.0906 1.0906 1.0886 1.0886 1.0956 1.0956 1.0965 1.0964 1.0985 1.0986
irintensity: 1.2171 2.2981 0.0000 0.0000 8.1441 0.8452 1.0053 0.0000 0.0000 1.4464 3.2266 0.0000 0.0000 0.0000 8.6142 0.0000 0.0000 0.8244 29.9397 0.0001 3.1326 1.3160 0.0002 1.1909 0.0707 0.0000 3.0274 0.0000 0.0000 0.0000 5.8093 0.0000 6.1595 4.5037 0.0000 0.0000 6.9991 0.0000 0.1616 0.0000 0.0000 57.2307 7.9693 0.0000 57.1096 0.0000 13.1679 1.3923 0.0000 57.5361 0.0000 0.0000 52.1420 0.0000 14.5461 0.0000 0.0000 34.4614 83.1810 4.2189 0.0000 15.4011 0.0000 0.0000 8.8961 2.9943 0.0000 0.0000 0.7265 0.0000 4.6229 3.8812 0.0000 17.6924 0.0000 19.3279 0.0000 0.0000 14.0157 0.0000 9.3988 0.0000 12.4135 0.0000 0.0000 214.4882 3.8098 751.9569 0.0000 0.0000 43.0791 0.0000 0.0000 58.3184 51.5762 8.3312 137.0185 0.0000 0.0000 7.1860 0.0000 13.7546 0.0000 0.0000 394.4224 0.0000 82.6262 0.0001 53.6627 0.0000 0.0000 60.5384 29.0113 0.0000 2.5941 4.7418 19.4426 0.0943 0.8232 0.0002 24.7179 0.1629 10.5945 0.0000 55.7470 0.0381
temp: 298.150 k
press: 1.00000 atm
elementType: 8 8 7 7 6 6 6 6 6 6 6 6 6 6 6 6 6 6 6 6 6 6 6 6 6 6 6 6 6 6 6 6 1 1 1 1 1 1 1 1 1 1 1 1
symmnumber: 1
zpe: 830932.4 jmol-1
zpe.correction: 0.316485 hartree
zpe.thermalcorrener: 0.337203 hartree
zpe.thermalcorrenthalpy: 0.338147 hartree
zpe.thermalcorrgfe: 0.267911 hartree
zpe.sumelectzpe: -1332.174913 hartree
zpe.sumelectthermal: -1332.154195 hartree
zpe.sumelectthermalent: -1332.153251 hartree
zpe.sumelectthermalfe: -1332.223488 hartree
dipole: 0.0000 0.0000 -0.0002
dipole: 0.0002
quadrupole: -162.8485 -177.8064 -185.7548
quadrupole: -30.4582 -0.0006 -0.0052
quadrupole: 12.6214 -2.3365 -10.2849 -30.4582 -0.0006 -0.0052
hfenergy: -1332.4913982 hartree
pointgroup: C01 [X(C28H12N2O2)]
dipole: 0.0000049 0.0000008 -0.0000832 debye
polarizability: 736.8316496|30.9418691|390.7523441|0.012864|-0.0014255|112.9247251 unknown
InChI: InChI=1S/C28H12N2O2/c31-27-15-7-3-1-5-13(15)25-21-17(27)9-12-20-23(21)24-19(29-25)11-10-18-22(24)26(30-20)14-6-2-4-8-16(14)28(18)32/h1-12H
charge 0 multiplicity 1
44 atoms
O  4.693182 2.83712 0.000627
O  -4.693174 -2.83711 0.000133
N  1.739529 -1.906433 0.0001
N  -1.73952 1.906443 0.000486
C  0.367832 0.608121 0.000279
C  -0.367822 -0.608111 0.000297
C  1.791649 0.562281 0.000149
C  -1.79164 -0.562272 0.000422
C  2.433472 -0.748232 0.000088
C  -2.433463 0.748242 0.0005
C  0.34608 -1.856805 0.00018
C  -0.34607 1.856815 0.0004
C  2.524351 1.780379 0.000138
C  -2.524342 -1.780369 0.000432
C  3.910769 -0.798831 0.00019
C  -3.91076 0.79884 0.000411
C  4.671513 0.413715 0.000194
C  -4.671503 -0.413705 0.000414
C  -0.414286 -3.061853 0.000172
C  0.414295 3.061863 0.000417
C  4.014555 1.757287 -0.000229
C  -4.014545 -1.757277 0.000743
C  1.820196 3.016768 0.000297
C  -1.820186 -3.016758 0.000287
C  4.590274 -2.044901 0.000386
C  -4.590266 2.044911 0.000249
C  6.088189 0.35359 0.000435
C  -6.088179 -0.353583 0.000228
C  5.9973 -2.090104 0.000618
C  -5.997292 2.090111 0.000062
C  6.750911 -0.887663 0.000646
C  -6.750901 0.887671 0.000051
H  0.12566 -4.013205 0.00009
H  -0.12565 4.013216 0.0005
H  2.413708 3.936574 0.000254
H  -2.413698 -3.936565 0.000324
H  3.988806 -2.958044 0.000392
H  -3.988799 2.958055 0.000243
H  6.640521 1.298603 0.000409
H  -6.640511 -1.298596 0.000256
H  6.511819 -3.057008 0.000783
H  -6.511811 3.057016 -0.000078
H  7.845272 -0.926274 0.000814
H  -7.845263 0.92628 -0.000088
