program: Orca
programVersion: 5.0.2
elementType: Br Br Br Br O O O N C C C C C C C C C C C C C C C C C C C C C C H H H H H H H H H H H H H H H H H H H
charge: 0
multiplicity: 1
keywords: wb97x-d3
keywords: def2-TZVPP
keywords: def2/J RIJCOSX
keywords: DEFGRID2
keywords: scfconv7
keywords: smallprint printgap noloewdin
keywords: NOSOSCF
formula: C22H19Br4NO3
InChI: InChI=1/C22H19Br4NO3/c1-21(2)17(19(23)22(24,25)26)18(21)20(28)30-16(12-27)13-7-6-10-15(11-13)29-14-8-4-3-5-9-14/h3-11,16-19H,1-2H3
49 atoms
Br 3.705195 -1.51646 -0.773785
Br 1.263883 0.88671 -1.14054
Br 0.207087 0.240896 1.736899
Br 3.175729 1.148118 1.343525
O  -1.739294 -2.811794 -0.439181
O  -2.011122 -3.083929 1.759927
O  -2.165247 2.168097 -1.113056
N  -3.685771 -2.940282 -3.095894
C  1.151003 -3.777301 0.011178
C  1.076578 -2.285631 -0.078616
C  0.189275 -3.017636 0.904909
C  2.157645 -1.375914 0.429175
C  2.284611 -4.456026 0.744297
C  0.670053 -4.576082 -1.175704
C  -1.281628 -2.985878 0.806966
C  1.744463 0.10204 0.557655
C  -3.127892 -2.519419 -0.579294
C  -3.4007 -1.088438 -0.184032
C  -3.425994 -2.757746 -1.992392
C  -2.736293 -0.069747 -0.851363
C  -4.23632 -0.804232 0.886881
C  -2.89038 1.244427 -0.432102
C  -4.385462 0.513288 1.292689
C  -3.710921 1.541699 0.651298
C  -2.43162 3.506136 -0.986928
C  -1.412577 4.331654 -0.537633
C  -3.660403 4.031306 -1.365599
C  -1.624206 5.70244 -0.475279
C  -3.86331 5.401017 -1.286096
C  -2.848839 6.24076 -0.843793
H  0.57962 -1.928095 -0.974378
H  0.50239 -2.987259 1.942559
H  2.511887 -1.70048 1.411178
H  3.139748 -4.609214 0.085443
H  2.625796 -3.902631 1.619365
H  1.957889 -5.437112 1.093606
H  1.518879 -4.804344 -1.822692
H  0.236685 -5.524919 -0.854746
H  -0.066275 -4.05554 -1.78336
H  -3.743619 -3.208031 0.007246
H  -2.084181 -0.284712 -1.690052
H  -4.753556 -1.600833 1.405561
H  -5.024666 0.747319 2.133831
H  -3.827784 2.5577 1.004895
H  -0.459945 3.906661 -0.247492
H  -4.44891 3.380954 -1.724446
H  -0.826542 6.348524 -0.131861
H  -4.819653 5.813579 -1.580511
H  -3.011664 7.309223 -0.791022
elementType: Br O N C H
nucrepener: 5948.87095995 hartree
cpcmener: -0.02936389 hartree
xcener: -389.802325310671 hartree
chargesum: 0.0000000
charge: -0.082477 -0.016963 -0.014973 -0.008216 -0.268682 -0.424850 -0.297935 -0.085355 0.103575 -0.110493 -0.110337 -0.153086 -0.268579 -0.258938 0.362499 0.061027 0.394559 0.053560 -0.234774 -0.294528 -0.201704 0.288943 -0.128723 -0.197465 0.253399 -0.208598 -0.186460 -0.142294 -0.143807 -0.168332 0.124173 0.115558 0.165894 0.098546 0.092447 0.109045 0.096174 0.105002 0.093269 0.139062 0.125172 0.144228 0.159591 0.152771 0.135141 0.158191 0.158844 0.158699 0.158201
qa: -0.0825 -0.0170 -0.0150 -0.0082 -0.2687 -0.4248 -0.2979 -0.0854 0.1036 -0.1105 -0.1103 -0.1531 -0.2686 -0.2589 0.3625 0.0610 0.3946 0.0536 -0.2348 -0.2945 -0.2017 0.2889 -0.1287 -0.1975 0.2534 -0.2086 -0.1865 -0.1423 -0.1438 -0.1683 0.1242 0.1156 0.1659 0.0985 0.0924 0.1090 0.0962 0.1050 0.0933 0.1391 0.1252 0.1442 0.1596 0.1528 0.1351 0.1582 0.1588 0.1587 0.1582
va: 1.1819 1.2232 1.2234 1.2258 2.1231 2.0818 2.0874 3.1079 3.8660 3.7239 3.8893 4.0556 3.9084 3.9050 4.1868 4.3057 3.7704 3.5873 4.0694 4.0403 3.9699 3.7419 3.9204 3.9233 3.7039 3.9806 3.9512 3.9113 3.8938 3.8928 1.0321 1.0226 0.9947 1.0059 1.0041 1.0023 1.0024 1.0005 1.0127 1.0137 1.0310 1.0070 0.9901 0.9994 1.0115 0.9963 0.9897 0.9898 0.9902
dispcorr: -0.034423110 hartree
energy: -11427.176130408694
dipole: -94.34619 94.51423 0.16804 -16.92879 17.19384 0.26504 -11.73678 13.20181 1.46504
magnitude: 1.49827 au
magnitude: 3.80830 debye
