program: Orca
programVersion: 5.0.2
elementType: Br Br Br Br O O O N C C C C C C C C C C C C C C C C C C C C C C H H H H H H H H H H H H H H H H H H H
charge: 0
multiplicity: 1
keywords: wb97x-d3
keywords: def2-TZVPP
keywords: def2/J RIJCOSX
keywords: DEFGRID2
keywords: scfconv7
keywords: smallprint printgap noloewdin
keywords: NOSOSCF
formula: C22H19Br4NO3
InChI: InChI=1/C22H19Br4NO3/c1-21(2)17(19(23)22(24,25)26)18(21)20(28)30-16(12-27)13-7-6-10-15(11-13)29-14-8-4-3-5-9-14/h3-11,16-19H,1-2H3
49 atoms
Br 3.893625 -2.680032 1.377048
Br 2.801263 -2.658887 -1.911343
Br 1.316573 0.043802 -1.376166
Br 4.401329 -0.144933 -0.90234
O  -2.1279 -0.519192 0.673235
O  -1.611279 -2.556987 -0.077424
O  -3.855406 4.16241 0.923987
N  -2.905009 -0.409491 -2.611436
C  0.51739 -2.361291 2.293122
C  1.143691 -2.184036 0.947394
C  -0.0669 -1.359491 1.312292
C  2.463006 -1.503346 0.726578
C  1.140617 -1.755268 3.527164
C  -0.181862 -3.669994 2.563766
C  -1.317093 -1.584383 0.567474
C  2.737196 -1.123034 -0.739891
C  -3.356015 -0.563534 -0.03714
C  -4.204219 0.603521 0.400474
C  -3.089523 -0.489094 -1.480327
C  -3.66535 1.883583 0.439147
C  -5.531763 0.386574 0.739151
C  -4.461164 2.945369 0.842752
C  -6.318811 1.460881 1.129616
C  -5.792833 2.740531 1.191769
C  -4.583183 5.307543 0.724637
C  -5.364191 5.4794 -0.41109
C  -4.463982 6.317792 1.666589
C  -6.035828 6.678919 -0.593671
C  -5.132592 7.517509 1.465226
C  -5.922923 7.701368 0.339776
H  0.941774 -3.004733 0.266309
H  0.107416 -0.325563 1.588428
H  2.533378 -0.587772 1.319982
H  1.632632 -0.801062 3.337935
H  0.369835 -1.574939 4.278543
H  1.874022 -2.433234 3.964781
H  -0.996615 -3.533051 3.276855
H  -0.590816 -4.132315 1.667751
H  0.525033 -4.376808 3.001676
H  -3.88997 -1.499526 0.152774
H  -2.633691 2.067397 0.162575
H  -5.948876 -0.611746 0.703894
H  -7.353151 1.298862 1.402626
H  -6.416695 3.562905 1.517528
H  -5.445936 4.690993 -1.149378
H  -3.849054 6.168176 2.545262
H  -6.64573 6.815499 -1.477347
H  -5.037061 8.308349 2.1981
H  -6.445986 8.636408 0.188231
elementType: Br O N C H
nucrepener: 5459.16753238 hartree
twoeener: 9863.73228284 hartree
cpcmener: -0.03273831 hartree
xcener: -389.799469666072 hartree
chargesum: -0.0000000
charge: -0.080734 -0.011362 -0.014131 -0.001437 -0.273696 -0.427770 -0.325593 -0.084885 0.094333 -0.099378 -0.136139 -0.148677 -0.260231 -0.260244 0.380493 0.039208 0.428899 0.003327 -0.240647 -0.218060 -0.181777 0.222754 -0.145797 -0.164229 0.249701 -0.174088 -0.225780 -0.148391 -0.131288 -0.171436 0.118614 0.119212 0.166140 0.091115 0.108731 0.098754 0.103585 0.094482 0.098703 0.127955 0.135055 0.146329 0.159984 0.157161 0.159375 0.146149 0.159312 0.157873 0.158525
qa: -0.0807 -0.0114 -0.0141 -0.0014 -0.2737 -0.4278 -0.3256 -0.0849 0.0943 -0.0994 -0.1361 -0.1487 -0.2602 -0.2602 0.3805 0.0392 0.4289 0.0033 -0.2406 -0.2181 -0.1818 0.2228 -0.1458 -0.1642 0.2497 -0.1741 -0.2258 -0.1484 -0.1313 -0.1714 0.1186 0.1192 0.1661 0.0911 0.1087 0.0988 0.1036 0.0945 0.0987 0.1280 0.1351 0.1463 0.1600 0.1572 0.1594 0.1461 0.1593 0.1579 0.1585
va: 1.1827 1.2231 1.2296 1.2308 2.1559 2.0791 2.0750 3.1082 3.8726 3.7370 3.8946 4.0569 3.9024 3.9001 4.1712 4.3522 3.7174 3.7495 4.0178 4.0707 3.9512 3.8222 3.9235 3.8943 3.7107 3.9171 4.0025 3.8916 3.8882 3.8951 1.0457 1.0212 0.9947 1.0037 1.0027 1.0060 0.9998 1.0173 1.0026 1.0226 1.0284 1.0024 0.9917 0.9958 0.9953 1.0069 0.9903 0.9894 0.9902
dispcorr: -0.028459701 hartree
energy: -11427.174840566855
dipole: -158.47022 156.85596 -1.61426 67.61289 -66.57176 1.04113 53.39037 -50.40813 2.98224
magnitude: 3.54733 au
magnitude: 9.01660 debye
