program: Orca
programVersion: 5.0.2
elementType: Br Br Br Br O O O N C C C C C C C C C C C C C C C C C C C C C C H H H H H H H H H H H H H H H H H H H
charge: 0
multiplicity: 1
keywords: wb97x-d3
keywords: def2-TZVPP
keywords: def2/J RIJCOSX
keywords: DEFGRID2
keywords: scfconv7
keywords: smallprint printgap noloewdin
keywords: NOSOSCF
formula: C22H19Br4NO3
InChI: InChI=1/C22H19Br4NO3/c1-21(2)17(19(23)22(24,25)26)18(21)20(28)30-16(12-27)13-7-6-10-15(11-13)29-14-8-4-3-5-9-14/h3-11,16-19H,1-2H3
49 atoms
Br 3.726364 -1.130213 -0.796133
Br 1.063692 1.102738 -1.118074
Br 0.20116 0.403902 1.819037
Br 3.069599 1.510792 1.273875
O  -1.607942 -2.429101 -0.520318
O  -1.960346 -3.305281 1.500776
O  -3.263188 2.268336 0.806168
N  -3.299427 -2.001562 -3.313593
C  1.296149 -3.535878 0.03208
C  1.160864 -2.049998 -0.091576
C  0.263236 -2.795164 0.862539
C  2.185706 -1.082517 0.422362
C  2.430461 -4.149555 0.816979
C  0.882456 -4.370641 -1.154533
C  -1.197941 -2.884079 0.670296
C  1.680265 0.365225 0.55524
C  -3.009929 -2.398082 -0.747506
C  -3.690186 -1.286563 0.017786
C  -3.153981 -2.181062 -2.188772
C  -3.130549 -0.013798 0.008273
C  -4.85915 -1.547348 0.71417
C  -3.761726 1.007499 0.70369
C  -5.480844 -0.514935 1.40291
C  -4.940821 0.758887 1.399863
C  -2.459721 2.826321 -0.151969
C  -2.675502 2.651245 -1.512859
C  -1.449031 3.662042 0.303345
C  -1.851861 3.308497 -2.416679
C  -0.648103 4.326925 -0.61134
C  -0.839637 4.148759 -1.974254
H  0.693562 -1.736805 -1.018497
H  0.514999 -2.750224 1.91637
H  2.565852 -1.386983 1.401109
H  2.715754 -3.566461 1.692859
H  2.139387 -5.13917 1.173511
H  3.314929 -4.272625 0.190744
H  0.530347 -5.352149 -0.832274
H  0.099253 -3.910712 -1.754096
H  1.742277 -4.526057 -1.808407
H  -3.473904 -3.361023 -0.50983
H  -2.213342 0.172831 -0.535942
H  -5.280428 -2.544382 0.721752
H  -6.394048 -0.704935 1.95109
H  -5.423223 1.563194 1.940921
H  -3.475924 2.018904 -1.875968
H  -1.297815 3.793533 1.367269
H  -2.017181 3.168289 -3.477267
H  0.138278 4.97835 -0.252663
H  -0.206581 4.661683 -2.686432
elementType: Br O N C H
nucrepener: 6076.19467862 hartree
cpcmener: -0.02991261 hartree
xcener: -389.807504123127 hartree
chargesum: -0.0000000
charge: -0.084421 -0.017264 -0.020010 -0.008107 -0.266270 -0.419675 -0.317110 -0.085262 0.098124 -0.097494 -0.145608 -0.142332 -0.269999 -0.259390 0.377905 0.063484 0.375409 0.045041 -0.225544 -0.278797 -0.222001 0.355589 -0.093735 -0.259397 0.336342 -0.221802 -0.276406 -0.126370 -0.077448 -0.208475 0.124888 0.121846 0.167314 0.092709 0.108427 0.098389 0.103852 0.093546 0.098224 0.145402 0.115124 0.143703 0.158533 0.145628 0.157805 0.135734 0.157301 0.149895 0.152704
qa: -0.0844 -0.0173 -0.0200 -0.0081 -0.2663 -0.4197 -0.3171 -0.0853 0.0981 -0.0975 -0.1456 -0.1423 -0.2700 -0.2594 0.3779 0.0635 0.3754 0.0450 -0.2255 -0.2788 -0.2220 0.3556 -0.0937 -0.2594 0.3363 -0.2218 -0.2764 -0.1264 -0.0774 -0.2085 0.1249 0.1218 0.1673 0.0927 0.1084 0.0984 0.1039 0.0935 0.0982 0.1454 0.1151 0.1437 0.1585 0.1456 0.1578 0.1357 0.1573 0.1499 0.1527
va: 1.1810 1.2223 1.2172 1.2276 2.1210 2.0906 2.0937 3.1058 3.8714 3.7082 3.9088 4.0327 3.9092 3.9081 4.1731 4.2935 3.7513 3.6337 4.0692 3.9705 3.9910 3.6403 3.8802 4.0168 3.6191 3.9036 3.9831 3.8533 3.8248 3.8915 1.0327 1.0205 0.9955 1.0042 1.0026 1.0055 1.0008 1.0126 1.0028 1.0150 1.0293 1.0039 0.9889 1.0074 0.9975 1.0152 0.9905 0.9913 0.9931
dispcorr: -0.036559234 hartree
energy: -11427.178789460495
dipole: -87.20807 87.67825 0.47019 -35.91604 35.11389 -0.80215 -12.06486 12.98424 0.91938
magnitude: 1.30759 au
magnitude: 3.32362 debye
