program: Orca
programVersion: 5.0.2
elementType: Br Br Br Br O O O N C C C C C C C C C C C C C C C C C C C C C C H H H H H H H H H H H H H H H H H H H
charge: 0
multiplicity: 1
keywords: wb97x-d3
keywords: def2-TZVPP
keywords: def2/J RIJCOSX
keywords: DEFGRID2
keywords: scfconv7
keywords: smallprint printgap noloewdin
keywords: NOSOSCF
formula: C22H19Br4NO3
InChI: InChI=1/C22H19Br4NO3/c1-21(2)17(19(23)22(24,25)26)18(21)20(28)30-16(12-27)13-7-6-10-15(11-13)29-14-8-4-3-5-9-14/h3-11,16-19H,1-2H3
49 atoms
Br 3.577356 -1.027934 2.099371
Br 2.158788 -3.702566 0.451357
Br 1.416533 -1.795796 -1.934468
Br 4.402316 -2.092425 -1.053286
O  -1.908596 0.571688 -0.899908
O  -1.907349 -1.055918 0.636481
O  -4.847746 4.355152 1.228392
N  -3.810781 1.266961 -3.520911
C  0.546916 0.643099 1.692788
C  0.993822 -0.62864 1.045247
C  0.050386 0.280944 0.303654
C  2.396106 -0.828185 0.549147
C  1.466203 1.841003 1.759718
C  -0.361488 0.532613 2.893041
C  -1.336188 -0.169381 0.065747
C  2.583752 -2.024669 -0.396784
C  -3.29051 0.333856 -1.136181
C  -4.156563 1.011088 -0.101602
C  -3.562572 0.862171 -2.475186
C  -4.083548 2.391882 0.045336
C  -4.994922 0.256939 0.702234
C  -4.879877 3.018941 0.992327
C  -5.781225 0.894902 1.651215
C  -5.732956 2.268719 1.796057
C  -4.528348 5.244515 0.240008
C  -5.057667 5.152785 -1.04112
C  -3.695522 6.2980 0.586204
C  -4.734583 6.122322 -1.977738
C  -3.391684 7.267546 -0.357099
C  -3.90363 7.181654 -1.642914
H  0.531916 -1.521577 1.454968
H  0.464422 0.887172 -0.494025
H  2.752953 0.054951 0.013405
H  2.112663 1.785474 2.635451
H  2.104507 1.946587 0.8825
H  0.876087 2.755048 1.836748
H  -1.011924 -0.337748 2.858063
H  0.243591 0.459375 3.797759
H  -0.990712 1.419515 2.983673
H  -3.501114 -0.740248 -1.148764
H  -3.415483 2.971114 -0.580928
H  -5.028276 -0.819105 0.597172
H  -6.440549 0.315103 2.282791
H  -6.348392 2.772095 2.529961
H  -5.716187 4.337004 -1.310545
H  -3.300082 6.357409 1.591682
H  -5.143244 6.04772 -2.976561
H  -2.745538 8.091074 -0.083316
H  -3.659873 7.935839 -2.378609
nucrepener: 5503.54046889 hartree
twoeener: 9907.09620898 hartree
xcener: -389.812048809334 hartree
chargesum: 0.0000000
charge: -0.060434 0.001204 -0.005808 0.007869 -0.263410 -0.364428 -0.295557 -0.002038 0.072807 -0.065972 -0.166588 -0.181604 -0.245722 -0.244171 0.356461 0.035927 0.334955 0.025186 -0.263514 -0.225885 -0.139090 0.248910 -0.083322 -0.212267 0.273826 -0.192431 -0.225411 -0.099210 -0.084686 -0.148474 0.121149 0.102998 0.149107 0.100544 0.076004 0.103394 0.100053 0.096109 0.092011 0.122321 0.131689 0.113051 0.128320 0.129722 0.137040 0.124492 0.131839 0.126138 0.126895
qa: -0.0604 0.0012 -0.0058 0.0079 -0.2634 -0.3644 -0.2956 -0.0020 0.0728 -0.0660 -0.1666 -0.1816 -0.2457 -0.2442 0.3565 0.0359 0.3350 0.0252 -0.2635 -0.2259 -0.1391 0.2489 -0.0833 -0.2123 0.2738 -0.1924 -0.2254 -0.0992 -0.0847 -0.1485 0.1211 0.1030 0.1491 0.1005 0.0760 0.1034 0.1001 0.0961 0.0920 0.1223 0.1317 0.1131 0.1283 0.1297 0.1370 0.1245 0.1318 0.1261 0.1269
va: 1.2033 1.2356 1.2364 1.2398 2.1267 2.1432 2.1210 3.1188 3.8854 3.6990 3.9210 4.1217 3.9019 3.9055 4.2087 4.3565 3.8309 3.6475 4.0262 3.9753 4.0037 3.8335 3.9499 4.0398 3.7684 3.9617 4.0511 3.9429 3.9265 3.9680 1.0449 1.0283 1.0030 1.0084 1.0080 1.0054 1.0209 1.0035 1.0022 1.0185 1.0191 1.0174 0.9997 1.0120 1.0030 1.0145 0.9990 0.9987 1.0004
dispcorr: -0.029361769 hartree
energy: -11427.143917988498
dipole: -142.51711 142.48764 -0.02947 122.39095 -121.63869 0.75226 17.88563 -16.82986 1.05577
magnitude: 1.29670 au
magnitude: 3.29594 debye
