program: Orca
programVersion: 5.0.2
elementType: Br Br Br Br O O O N C C C C C C C C C C C C C C C C C C C C C C H H H H H H H H H H H H H H H H H H H
charge: 0
multiplicity: 1
keywords: wb97x-d3
keywords: def2-TZVPP
keywords: def2/J RIJCOSX
keywords: DEFGRID2
keywords: scfconv7
keywords: smallprint printgap noloewdin
keywords: NOSOSCF
formula: C22H19Br4NO3
InChI: InChI=1/C22H19Br4NO3/c1-21(2)17(19(23)22(24,25)26)18(21)20(28)30-16(12-27)13-7-6-10-15(11-13)29-14-8-4-3-5-9-14/h3-11,16-19H,1-2H3
49 atoms
Br 3.588924 -2.145776 -0.904765
Br 3.298414 0.892965 0.714644
Br 1.191781 -0.390086 2.662173
Br 4.054339 -1.6156 2.460665
O  -2.524063 -0.885267 0.722265
O  -1.36706 0.621063 -0.460141
O  -5.743383 2.774217 -2.65605
N  -5.181898 -0.871903 2.687374
C  0.132923 -2.056696 -1.338774
C  0.969301 -1.196607 -0.445687
C  -0.43389 -1.543531 -0.027152
C  2.134946 -1.725334 0.338151
C  0.357765 -3.548762 -1.415025
C  -0.317498 -1.461905 -2.651018
C  -1.449122 -0.470503 0.028325
C  2.64787 -0.77418 1.43345
C  -3.601374 0.035285 0.814908
C  -4.363042 0.169474 -0.482685
C  -4.47369 -0.487113 1.869352
C  -4.662277 1.436443 -0.957512
C  -4.770674 -0.963389 -1.172619
C  -5.378887 1.574065 -2.139792
C  -5.482964 -0.81267 -2.351814
C  -5.786978 0.445985 -2.841146
C  -5.08026 3.916113 -2.294375
C  -5.829346 4.9673 -1.790609
C  -3.709484 4.044133 -2.477719
C  -5.199853 6.162268 -1.474166
C  -3.091339 5.23945 -2.146812
C  -3.831243 6.301446 -1.645665
H  1.09622 -0.18026 -0.805267
H  -0.550517 -2.302983 0.738167
H  1.882463 -2.668036 0.830233
H  1.117979 -3.788261 -2.158392
H  0.67041 -3.989349 -0.468381
H  -0.566543 -4.046798 -1.711306
H  -0.468025 -0.386202 -2.600318
H  0.434864 -1.656788 -3.416478
H  -1.25349 -1.91655 -2.979743
H  -3.238514 1.018973 1.132025
H  -4.331626 2.308832 -0.408446
H  -4.544279 -1.951935 -0.794939
H  -5.807667 -1.687188 -2.899398
H  -6.343537 0.564541 -3.761295
H  -6.896402 4.847992 -1.656774
H  -3.130195 3.219224 -2.872784
H  -5.784787 6.984953 -1.084965
H  -2.023454 5.340573 -2.287149
H  -3.342944 7.232691 -1.392699
nucrepener: 5523.39381745 hartree
twoeener: 9926.75571504 hartree
xcener: -389.811732045723 hartree
chargesum: 0.0000000
charge: -0.060436 0.000355 -0.006340 0.009386 -0.259361 -0.358763 -0.293866 0.001100 0.075573 -0.071168 -0.156725 -0.176820 -0.246777 -0.242277 0.341614 0.034060 0.303506 0.035562 -0.249196 -0.129905 -0.222426 0.235639 -0.084313 -0.197496 0.234958 -0.193878 -0.172209 -0.098410 -0.110056 -0.137117 0.119625 0.102135 0.147984 0.100919 0.076808 0.103036 0.097470 0.097487 0.089662 0.119061 0.109736 0.124378 0.127914 0.128971 0.126996 0.137391 0.128042 0.129922 0.128251
qa: -0.0604 0.0004 -0.0063 0.0094 -0.2594 -0.3588 -0.2939 0.0011 0.0756 -0.0712 -0.1567 -0.1768 -0.2468 -0.2423 0.3416 0.0341 0.3035 0.0356 -0.2492 -0.1299 -0.2224 0.2356 -0.0843 -0.1975 0.2350 -0.1939 -0.1722 -0.0984 -0.1101 -0.1371 0.1196 0.1021 0.1480 0.1009 0.0768 0.1030 0.0975 0.0975 0.0897 0.1191 0.1097 0.1244 0.1279 0.1290 0.1270 0.1374 0.1280 0.1299 0.1283
va: 1.2021 1.2348 1.2367 1.2415 2.1231 2.1486 2.1194 3.1199 3.8858 3.7062 3.9019 4.1139 3.9026 3.9051 4.2198 4.3641 3.8526 3.6717 4.0154 3.9432 4.0233 3.8756 3.9430 4.0294 3.8064 4.0435 3.9727 3.9319 3.9414 3.9550 1.0468 1.0286 1.0032 1.0078 1.0076 1.0053 1.0207 1.0040 1.0037 1.0209 1.0187 1.0185 0.9988 1.0120 1.0125 1.0030 0.9989 0.9992 0.9998
dispcorr: -0.029449990 hartree
energy: -11427.143043639295
dipole: -154.28952 154.64601 0.35649 36.97017 -36.98782 -0.01765 -70.14886 68.93556 -1.21330
magnitude: 1.26471 au
magnitude: 3.21463 debye
