program: Orca
programVersion: 5.0.2
elementType: Br Br Br Br O O O N C C C C C C C C C C C C C C C C C C C C C C H H H H H H H H H H H H H H H H H H H
charge: 0
multiplicity: 1
keywords: wb97x-d3
keywords: def2-TZVPP
keywords: def2/J RIJCOSX
keywords: DEFGRID2
keywords: scfconv7
keywords: smallprint printgap noloewdin
keywords: NOSOSCF
formula: C22H19Br4NO3
InChI: InChI=1/C22H19Br4NO3/c1-21(2)17(19(23)22(24,25)26)18(21)20(28)30-16(12-27)13-7-6-10-15(11-13)29-14-8-4-3-5-9-14/h3-11,16-19H,1-2H3
49 atoms
Br 3.392148 -1.973757 -1.406409
Br 3.236585 1.035334 0.293622
Br 1.492302 -0.357385 2.504005
Br 4.340528 -1.464979 1.84726
O  -2.580607 -1.008519 0.877322
O  -1.497515 0.639286 -0.181264
O  -5.497521 2.830652 -2.448705
N  -5.308919 -1.307743 2.732571
C  -0.075596 -1.989644 -1.355571
C  0.840207 -1.117835 -0.554608
C  -0.484667 -1.520448 0.029435
C  2.12204 -1.619927 0.042456
C  0.181138 -3.471325 -1.496494
C  -0.702719 -1.379594 -2.585096
C  -1.53218 -0.492609 0.211608
C  2.76211 -0.667201 1.065383
C  -3.711686 -0.1575 1.01452
C  -4.415525 0.068076 -0.302625
C  -4.593739 -0.821561 1.976757
C  -4.629403 1.366686 -0.733984
C  -4.814394 -1.01272 -1.07702
C  -5.235878 1.591401 -1.963203
C  -5.428003 -0.776424 -2.296865
C  -5.634398 0.516589 -2.748034
C  -4.772166 3.915975 -2.038577
C  -3.383047 3.906024 -2.005475
C  -5.479197 5.062077 -1.70905
C  -2.707659 5.057065 -1.630699
C  -4.78976 6.209895 -1.34861
C  -3.404031 6.211512 -1.302685
H  0.884656 -0.091364 -0.904477
H  -0.487805 -2.298732 0.784891
H  1.974039 -2.576819 0.549793
H  0.851771 -3.671506 -2.331843
H  0.618715 -3.921495 -0.605347
H  -0.757888 -3.991738 -1.690192
H  -0.046917 -1.53458 -3.44292
H  -1.661611 -1.851042 -2.807256
H  -0.871735 -0.309364 -2.488759
H  -3.415564 0.80641 1.442255
H  -4.304942 2.196705 -0.119976
H  -4.653956 -2.026924 -0.734535
H  -5.745573 -1.609072 -2.909979
H  -6.105366 0.702019 -3.704282
H  -2.82988 3.010815 -2.260026
H  -6.560588 5.05051 -1.742689
H  -1.626374 5.047796 -1.59925
H  -5.342948 7.104327 -1.094696
H  -2.869349 7.106052 -1.013719
nucrepener: 5557.92485441 hartree
twoeener: 9961.21551844 hartree
xcener: -389.812698750632 hartree
chargesum: -0.0000000
charge: -0.061821 0.000327 -0.007861 0.010322 -0.252979 -0.358053 -0.293947 0.000923 0.076384 -0.070062 -0.155723 -0.175897 -0.247322 -0.238881 0.339016 0.034194 0.307052 0.046280 -0.251908 -0.151969 -0.239786 0.257553 -0.075647 -0.205600 0.260675 -0.185857 -0.212592 -0.108473 -0.089045 -0.144552 0.117317 0.102192 0.147788 0.101702 0.076162 0.103139 0.100157 0.089059 0.092621 0.118032 0.115262 0.124357 0.128901 0.129308 0.137967 0.126247 0.130516 0.127211 0.127309
qa: -0.0618 0.0003 -0.0079 0.0103 -0.2530 -0.3581 -0.2939 0.0009 0.0764 -0.0701 -0.1557 -0.1759 -0.2473 -0.2389 0.3390 0.0342 0.3071 0.0463 -0.2519 -0.1520 -0.2398 0.2576 -0.0756 -0.2056 0.2607 -0.1859 -0.2126 -0.1085 -0.0890 -0.1446 0.1173 0.1022 0.1478 0.1017 0.0762 0.1031 0.1002 0.0891 0.0926 0.1180 0.1153 0.1244 0.1289 0.1293 0.1380 0.1262 0.1305 0.1272 0.1273
va: 1.2010 1.2346 1.2337 1.2422 2.1337 2.1468 2.1248 3.1189 3.8911 3.7058 3.8897 4.1135 3.9006 3.9037 4.2402 4.3686 3.8497 3.6234 4.0175 3.9412 4.0264 3.8647 3.9247 4.0366 3.7803 3.9612 4.0505 3.9420 3.9271 3.9620 1.0479 1.0283 1.0032 1.0078 1.0074 1.0053 1.0051 1.0051 1.0190 1.0188 1.0162 1.0181 0.9985 1.0121 1.0033 1.0138 0.9990 0.9987 1.0000
dispcorr: -0.030149835 hartree
energy: -11427.143199955097
dipole: -156.01310 156.38238 0.36928 33.36085 -33.34853 0.01232 -55.33091 54.21534 -1.11556
magnitude: 1.17516 au
magnitude: 2.98702 debye
