program: Orca
programVersion: 5.0.2
elementType: Br Br Br Br O O O N C C C C C C C C C C C C C C C C C C C C C C H H H H H H H H H H H H H H H H H H H
charge: 0
multiplicity: 1
keywords: wb97x-d3
keywords: def2-TZVPP
keywords: def2/J RIJCOSX
keywords: DEFGRID2
keywords: scfconv7
keywords: smallprint printgap noloewdin
keywords: NOSOSCF
formula: C22H19Br4NO3
InChI: InChI=1/C22H19Br4NO3/c1-21(2)17(19(23)22(24,25)26)18(21)20(28)30-16(12-27)13-7-6-10-15(11-13)29-14-8-4-3-5-9-14/h3-11,16-19H,1-2H3
49 atoms
Br 3.628078 0.701829 -0.026131
Br 2.488155 -0.871438 2.826135
Br 1.142541 -3.069512 1.034555
Br 4.223015 -2.575717 0.827503
O  -2.472845 -1.238845 -0.95656
O  -1.876092 -0.27527 0.973913
O  -3.995511 3.245579 -2.481621
N  -5.170619 -2.732777 -2.170977
C  0.343875 0.755909 -1.136307
C  0.904258 -0.030648 0.009576
C  -0.255045 -0.589726 -0.762858
C  2.250845 -0.691058 -0.046917
C  1.054055 0.810719 -2.468371
C  -0.376576 2.040029 -0.80136
C  -1.582432 -0.672929 -0.116441
C  2.518078 -1.697994 1.084348
C  -3.827178 -1.196137 -0.540378
C  -4.389535 0.208309 -0.560107
C  -4.560024 -2.05856 -1.470005
C  -3.967075 1.107952 -1.527179
C  -5.311196 0.593666 0.39972
C  -4.45086 2.406531 -1.511767
C  -5.813977 1.885303 0.384443
C  -5.385875 2.801086 -0.56145
C  -3.757696 4.557568 -2.176729
C  -4.187124 5.515199 -3.08217
C  -3.06344 4.926628 -1.030796
C  -3.914273 6.853294 -2.840079
C  -2.806286 6.268249 -0.797083
C  -3.229032 7.23608 -1.697021
H  0.646792 0.369057 0.985535
H  -0.054381 -1.382028 -1.476149
H  2.386407 -1.229882 -0.988218
H  1.79344 1.61131 -2.481268
H  1.564837 -0.117369 -2.724635
H  0.333467 1.00994 -3.262786
H  -0.907657 1.993571 0.147677
H  0.345741 2.855041 -0.736822
H  -1.095963 2.299611 -1.580024
H  -3.936521 -1.615138 0.466076
H  -3.253665 0.821747 -2.289685
H  -5.628709 -0.103896 1.164015
H  -6.538687 2.188791 1.127643
H  -5.773243 3.811452 -0.556782
H  -4.724749 5.208419 -3.969595
H  -2.725543 4.175824 -0.327505
H  -4.247717 7.600069 -3.548276
H  -2.265909 6.556121 0.094968
H  -3.023049 8.281008 -1.509343
nucrepener: 5560.58191414 hartree
twoeener: 9963.81151427 hartree
xcener: -389.812434987415 hartree
chargesum: 0.0000000
charge: -0.060790 0.001292 -0.006866 0.008685 -0.263480 -0.336137 -0.303943 0.002546 0.097944 -0.066803 -0.165856 -0.188997 -0.246341 -0.267840 0.315759 0.037352 0.306437 0.073046 -0.253436 -0.237236 -0.146637 0.194666 -0.105052 -0.141051 0.240943 -0.203508 -0.149602 -0.096699 -0.139098 -0.132069 0.120282 0.103733 0.149215 0.102203 0.077242 0.105512 0.102244 0.109441 0.082521 0.127056 0.135295 0.106094 0.129659 0.135619 0.129238 0.133839 0.127328 0.129057 0.127191
qa: -0.0608 0.0013 -0.0069 0.0087 -0.2635 -0.3361 -0.3039 0.0025 0.0979 -0.0668 -0.1659 -0.1890 -0.2463 -0.2678 0.3158 0.0374 0.3064 0.0730 -0.2534 -0.2372 -0.1466 0.1947 -0.1051 -0.1411 0.2409 -0.2035 -0.1496 -0.0967 -0.1391 -0.1321 0.1203 0.1037 0.1492 0.1022 0.0772 0.1055 0.1022 0.1094 0.0825 0.1271 0.1353 0.1061 0.1297 0.1356 0.1292 0.1338 0.1273 0.1291 0.1272
va: 1.2032 1.2354 1.2340 1.2403 2.1131 2.1668 2.0859 3.1193 3.8839 3.7090 3.8959 4.1324 3.8963 3.8928 4.2635 4.3602 3.8238 3.6493 4.0153 4.0196 4.0465 3.8963 3.9655 3.9465 3.7709 4.0485 3.9245 3.9411 3.9841 3.9542 1.0441 1.0286 1.0024 1.0076 1.0074 1.0058 1.0130 1.0074 1.0068 1.0145 1.0219 1.0127 1.0004 1.0021 1.0127 1.0014 0.9987 1.0004 0.9998
dispcorr: -0.031592869 hartree
energy: -11427.143181063537
dipole: -140.76626 140.94703 0.18076 97.39928 -95.80569 1.59359 -62.72619 62.90134 0.17516
magnitude: 1.61335 au
magnitude: 4.10081 debye
