program: Orca
programVersion: 5.0.2
elementType: Br Br Br Br O O O N C C C C C C C C C C C C C C C C C C C C C C H H H H H H H H H H H H H H H H H H H
charge: 0
multiplicity: 1
keywords: wb97x-d3
keywords: def2-TZVPP
keywords: def2/J RIJCOSX
keywords: DEFGRID2
keywords: scfconv7
keywords: smallprint printgap noloewdin
keywords: NOSOSCF
formula: C22H19Br4NO3
InChI: InChI=1/C22H19Br4NO3/c1-21(2)17(19(23)22(24,25)26)18(21)20(28)30-16(12-27)13-7-6-10-15(11-13)29-14-8-4-3-5-9-14/h3-11,16-19H,1-2H3
49 atoms
Br 3.776342 0.454386 0.766175
Br 2.782002 -2.854248 0.981135
Br 0.859252 -2.396487 -1.453602
Br 3.924633 -1.845803 -1.769875
O  -2.534203 -0.289552 -0.272745
O  -1.668023 -0.971072 1.683388
O  -5.236757 3.916261 -0.087102
N  -4.561597 -2.406259 -1.862423
C  0.410307 1.306713 1.000368
C  1.001624 -0.043257 0.751815
C  -0.337409 0.294665 0.148974
C  2.191073 -0.257746 -0.137703
C  0.907482 2.52942 0.264328
C  -0.040994 1.612274 2.407413
C  -1.543753 -0.399049 0.638719
C  2.436222 -1.722113 -0.540392
C  -3.804754 -0.805584 0.060481
C  -4.819817 0.301744 0.267567
C  -4.216698 -1.69136 -1.032413
C  -4.505507 1.623224 -0.003907
C  -6.084523 -0.040793 0.729509
C  -5.467034 2.607212 0.20365
C  -7.035604 0.947367 0.915431
C  -6.732359 2.275378 0.661768
C  -4.011242 4.47112 0.144297
C  -3.498053 5.313069 -0.831387
C  -3.321225 4.26483 1.333012
C  -2.29057 5.958108 -0.612846
C  -2.113688 4.914607 1.536586
C  -1.590864 5.759849 0.567813
H  0.957526 -0.708751 1.608511
H  -0.35835 0.52704 -0.909739
H  2.094437 0.312263 -1.065311
H  1.754478 2.975852 0.785608
H  1.221479 2.321981 -0.758634
H  0.113372 3.276153 0.212069
H  0.786364 2.05606 2.962984
H  -0.86197 2.331175 2.398205
H  -0.36907 0.730564 2.951725
H  -3.741714 -1.410796 0.97145
H  -3.529581 1.893859 -0.383231
H  -6.330808 -1.07516 0.935681
H  -8.022113 0.683986 1.271914
H  -7.468553 3.053742 0.811245
H  -4.050981 5.46489 -1.748973
H  -3.728331 3.616762 2.098882
H  -1.895813 6.617987 -1.373941
H  -1.582978 4.767728 2.468323
H  -0.650803 6.267074 0.737345
nucrepener: 5612.55930206 hartree
xcener: -389.814308223527 hartree
chargesum: 0.0000000
charge: -0.060862 0.000501 -0.000545 0.008157 -0.285652 -0.362283 -0.296932 0.001331 0.118711 -0.084664 -0.189028 -0.181158 -0.245030 -0.247993 0.363561 0.035898 0.314197 0.083763 -0.255606 -0.173785 -0.215664 0.213890 -0.081014 -0.202362 0.233363 -0.204051 -0.133171 -0.079314 -0.175112 -0.154901 0.122930 0.102933 0.149067 0.099055 0.077212 0.099234 0.099300 0.070697 0.106023 0.139058 0.137437 0.120172 0.129331 0.129855 0.129059 0.137940 0.129778 0.142834 0.133838
qa: -0.0609 0.0005 -0.0005 0.0082 -0.2857 -0.3623 -0.2969 0.0013 0.1187 -0.0847 -0.1890 -0.1812 -0.2450 -0.2480 0.3636 0.0359 0.3142 0.0838 -0.2556 -0.1738 -0.2157 0.2139 -0.0810 -0.2024 0.2334 -0.2041 -0.1332 -0.0793 -0.1751 -0.1549 0.1229 0.1029 0.1491 0.0991 0.0772 0.0992 0.0993 0.0707 0.1060 0.1391 0.1374 0.1202 0.1293 0.1299 0.1291 0.1379 0.1298 0.1428 0.1338
va: 1.2018 1.2343 1.2405 1.2399 2.0921 2.1500 2.1148 3.1176 3.8322 3.7542 3.9306 4.1205 3.9076 3.9034 4.1818 4.3567 3.7626 3.6924 3.9960 3.9391 4.0612 3.8607 3.9491 4.0477 3.8231 4.0399 3.8883 3.9239 3.8988 3.9086 1.0438 1.0304 1.0022 1.0087 1.0114 1.0127 1.0041 1.0145 1.0241 1.0309 1.0191 1.0112 0.9990 1.0115 1.0130 1.0029 0.9972 0.9918 0.9990
dispcorr: -0.031607612 hartree
energy: -11427.144877539333
dipole: -138.90177 138.94017 0.03840 102.50186 -100.67540 1.82646 26.62290 -25.85745 0.76545
magnitude: 1.98074 au
magnitude: 5.03465 debye
