program: Orca
programVersion: 5.0.2
elementType: Br Br Br Br O O O N C C C C C C C C C C C C C C C C C C C C C C H H H H H H H H H H H H H H H H H H H
charge: 0
multiplicity: 1
keywords: wb97x-d3
keywords: def2-TZVPP
keywords: def2/J RIJCOSX
keywords: DEFGRID2
keywords: scfconv7
keywords: smallprint printgap noloewdin
keywords: NOSOSCF
formula: C22H19Br4NO3
InChI: InChI=1/C22H19Br4NO3/c1-21(2)17(19(23)22(24,25)26)18(21)20(28)30-16(12-27)13-7-6-10-15(11-13)29-14-8-4-3-5-9-14/h3-11,16-19H,1-2H3
49 atoms
Br 3.753719 -0.475112 -1.161369
Br 2.733848 0.299257 2.077241
Br 0.742628 -2.126447 1.965411
Br 3.793788 -2.608315 1.508651
O  -2.501707 -0.832938 0.156416
O  -1.468614 1.152455 0.094886
O  -5.498717 3.442788 -1.806073
N  -4.60364 -2.105165 2.361646
C  0.359897 -0.231791 -2.035518
C  0.999214 -0.253995 -0.68629
C  -0.409851 -0.772888 -0.844562
C  2.125701 -1.176312 -0.328082
C  0.739013 -1.259278 -3.077255
C  0.034447 1.115158 -2.633628
C  -1.48468 -0.019874 -0.165298
C  2.34915 -1.363732 1.182049
C  -3.613345 -0.237711 0.827013
C  -4.618718 0.290156 -0.166128
C  -4.166365 -1.291875 1.679001
C  -4.588077 1.639275 -0.493082
C  -5.521769 -0.564309 -0.785755
C  -5.457383 2.129523 -1.459776
C  -6.397905 -0.058336 -1.731747
C  -6.365531 1.282137 -2.079265
C  -4.34922 4.181807 -1.858085
C  -3.170582 3.683395 -2.399113
C  -4.416179 5.488478 -1.398366
C  -2.056803 4.505046 -2.470878
C  -3.296834 6.301782 -1.486257
C  -2.112084 5.814339 -2.01688
H  1.059272 0.721652 -0.21457
H  -0.548667 -1.847537 -0.847538
H  1.976019 -2.172537 -0.751432
H  -0.070009 -1.37117 -3.800308
H  1.631603 -0.947507 -3.619963
H  0.932592 -2.2477 -2.660323
H  -0.808552 1.036623 -3.323092
H  -0.209314 1.864155 -1.884457
H  0.894363 1.474253 -3.201029
H  -3.273333 0.572202 1.479433
H  -3.881987 2.299328 -0.006027
H  -5.554045 -1.614391 -0.525052
H  -7.110595 -0.715949 -2.210689
H  -7.043411 1.680166 -2.82264
H  -3.116937 2.664787 -2.761125
H  -5.342587 5.861103 -0.981651
H  -1.139225 4.115018 -2.8916
H  -3.35226 7.32168 -1.129612
H  -1.23892 6.449458 -2.077552
nucrepener: 5612.64383626 hartree
xcener: -389.813591558979 hartree
chargesum: 0.0000000
charge: -0.059240 0.001636 -0.003014 0.008961 -0.250966 -0.386080 -0.297835 -0.001160 0.102776 -0.092633 -0.180074 -0.170820 -0.242419 -0.279388 0.391659 0.034460 0.311486 -0.002376 -0.256906 -0.154414 -0.171972 0.224940 -0.095838 -0.198578 0.254133 -0.164119 -0.216587 -0.097918 -0.084006 -0.155779 0.127375 0.104780 0.150680 0.102678 0.101285 0.076370 0.093628 0.096663 0.100963 0.124363 0.138709 0.122607 0.130811 0.129804 0.124321 0.125611 0.130006 0.126065 0.125350
qa: -0.0592 0.0016 -0.0030 0.0090 -0.2510 -0.3861 -0.2978 -0.0012 0.1028 -0.0926 -0.1801 -0.1708 -0.2424 -0.2794 0.3917 0.0345 0.3115 -0.0024 -0.2569 -0.1544 -0.1720 0.2249 -0.0958 -0.1986 0.2541 -0.1641 -0.2166 -0.0979 -0.0840 -0.1558 0.1274 0.1048 0.1507 0.1027 0.1013 0.0764 0.0936 0.0967 0.1010 0.1244 0.1387 0.1226 0.1308 0.1298 0.1243 0.1256 0.1300 0.1261 0.1253
va: 1.2044 1.2342 1.2396 1.2415 2.1279 2.1096 2.1193 3.1161 3.8569 3.7104 3.9714 4.1095 3.9044 3.9082 4.1537 4.3416 3.8340 3.6915 4.0184 3.9064 4.0424 3.8702 3.9490 4.0483 3.8262 3.9482 4.0457 3.9360 3.9355 3.9992 1.0398 1.0272 1.0028 1.0048 1.0082 1.0094 0.9967 1.0157 1.0055 1.0191 1.0197 1.0166 0.9995 1.0115 1.0027 1.0139 0.9956 0.9983 1.0017
dispcorr: -0.031092473 hartree
energy: -11427.145369299367
dipole: -137.56111 137.77870 0.21758 69.64622 -69.12051 0.52571 -71.98398 70.39673 -1.58725
magnitude: 1.68614 au
magnitude: 4.28584 debye
