program: Orca
programVersion: 5.0.2
elementType: Br Br Br Br O O O N C C C C C C C C C C C C C C C C C C C C C C H H H H H H H H H H H H H H H H H H H
charge: 0
multiplicity: 1
keywords: wb97x-d3
keywords: def2-TZVPP
keywords: def2/J RIJCOSX
keywords: DEFGRID2
keywords: scfconv7
keywords: smallprint printgap noloewdin
keywords: NOSOSCF
formula: C22H19Br4NO3
InChI: InChI=1/C22H19Br4NO3/c1-21(2)17(19(23)22(24,25)26)18(21)20(28)30-16(12-27)13-7-6-10-15(11-13)29-14-8-4-3-5-9-14/h3-11,16-19H,1-2H3
49 atoms
Br 3.904338 0.462536 -0.203611
Br 2.843421 -2.350187 1.518307
Br 0.633055 -2.800472 -0.664392
Br 3.645139 -2.702721 -1.500994
O  -2.503992 -0.134567 -0.115361
O  -1.382723 -0.026927 1.828639
O  -5.179484 4.009918 -0.945486
N  -4.319058 -2.920514 -0.049154
C  0.619067 1.610719 -0.002335
C  1.141027 0.241962 0.293613
C  -0.258377 0.393982 -0.242039
C  2.193492 -0.429228 -0.539293
C  1.042865 2.358745 -1.244968
C  0.364151 2.525468 1.17049
C  -1.397779 0.056604 0.633758
C  2.335992 -1.941732 -0.296063
C  -3.718261 -0.445426 0.540689
C  -4.804728 0.527147 0.126901
C  -4.056355 -1.831038 0.201285
C  -4.455015 1.821005 -0.235431
C  -6.138918 0.150421 0.175908
C  -5.449979 2.738043 -0.54797
C  -7.120942 1.075922 -0.145098
C  -6.788173 2.368835 -0.504558
C  -3.980639 4.579584 -0.613087
C  -3.14087 4.993405 -1.634522
C  -3.63322 4.78271 0.716614
C  -1.94525 5.625291 -1.321393
C  -2.433666 5.407447 1.016987
C  -1.585646 5.830524 0.00201
H  1.196258 0.012301 1.353145
H  -0.417634 0.154796 -1.28732
H  1.992899 -0.298689 -1.605787
H  1.965854 2.910915 -1.067873
H  1.203828 1.712117 -2.107615
H  0.26921 3.07789 -1.5195
H  1.272578 3.087357 1.39293
H  -0.421843 3.24488 0.933763
H  0.076502 1.991818 2.072941
H  -3.580793 -0.395682 1.626715
H  -3.416306 2.115176 -0.291591
H  -6.420614 -0.858105 0.449432
H  -8.161512 0.782641 -0.113603
H  -7.551916 3.092082 -0.757145
H  -3.430131 4.82942 -2.664223
H  -4.298517 4.461423 1.507879
H  -1.293503 5.95716 -2.118783
H  -2.163736 5.570349 2.052017
H  -0.653634 6.323534 0.243117
nucrepener: 5615.46247783 hartree
xcener: -389.813652660668 hartree
chargesum: 0.0000000
charge: -0.061267 0.001447 0.000983 0.007353 -0.271684 -0.359359 -0.294588 -0.002965 0.100645 -0.073690 -0.181771 -0.177636 -0.247930 -0.224472 0.357093 0.034304 0.337336 0.002718 -0.256482 -0.159921 -0.196438 0.243382 -0.077254 -0.207956 0.217552 -0.170553 -0.149234 -0.124396 -0.115774 -0.149088 0.121524 0.101412 0.148116 0.099998 0.077448 0.097384 0.097740 0.058228 0.104075 0.129518 0.117680 0.123191 0.129279 0.127767 0.129637 0.135165 0.132870 0.135001 0.133610
qa: -0.0613 0.0014 0.0010 0.0074 -0.2717 -0.3594 -0.2946 -0.0030 0.1006 -0.0737 -0.1818 -0.1776 -0.2479 -0.2245 0.3571 0.0343 0.3373 0.0027 -0.2565 -0.1599 -0.1964 0.2434 -0.0773 -0.2080 0.2176 -0.1706 -0.1492 -0.1244 -0.1158 -0.1491 0.1215 0.1014 0.1481 0.1000 0.0774 0.0974 0.0977 0.0582 0.1041 0.1295 0.1177 0.1232 0.1293 0.1278 0.1296 0.1352 0.1329 0.1350 0.1336
va: 1.2025 1.2359 1.2421 1.2401 2.1066 2.1494 2.1157 3.1101 3.8447 3.7269 3.9308 4.1153 3.9091 3.8929 4.1909 4.3601 3.7922 3.8245 4.0140 3.9195 4.0392 3.8332 3.9639 4.0416 3.8356 4.0105 3.9648 3.8836 3.8672 3.8752 1.0461 1.0308 1.0028 1.0078 1.0099 1.0088 1.0058 1.0187 1.0251 1.0259 1.0232 1.0195 0.9993 1.0131 1.0108 1.0027 0.9975 0.9986 0.9994
dispcorr: -0.031633080 hartree
energy: -11427.145420347093
dipole: -134.21141 134.16300 -0.04841 113.13636 -111.02517 2.11119 3.58515 -3.79258 -0.20743
magnitude: 2.12191 au
magnitude: 5.39346 debye
