program: Orca
programVersion: 5.0.2
elementType: Br Br Br Br O O O N C C C C C C C C C C C C C C C C C C C C C C H H H H H H H H H H H H H H H H H H H
charge: 0
multiplicity: 1
keywords: wb97x-d3
keywords: def2-TZVPP
keywords: def2/J RIJCOSX
keywords: DEFGRID2
keywords: scfconv7
keywords: smallprint printgap noloewdin
keywords: NOSOSCF
formula: C22H19Br4NO3
InChI: InChI=1/C22H19Br4NO3/c1-21(2)17(19(23)22(24,25)26)18(21)20(28)30-16(12-27)13-7-6-10-15(11-13)29-14-8-4-3-5-9-14/h3-11,16-19H,1-2H3
49 atoms
Br 3.768475 0.522495 -0.754498
Br 3.022491 -1.164689 2.18321
Br 0.967116 -2.927244 0.597788
Br 3.96462 -2.868995 -0.288561
O  -2.57234 -0.561508 -0.178608
O  -1.433738 0.455488 1.469047
O  -5.061495 3.623149 -1.663271
N  -4.514368 -3.040548 0.860224
C  0.360918 1.171279 -1.061398
C  1.042668 0.229039 -0.119321
C  -0.348849 -0.087725 -0.593075
C  2.199269 -0.63091 -0.536902
C  0.723886 1.204958 -2.52761
C  -0.042528 2.524172 -0.527662
C  -1.465006 -0.024383 0.371216
C  2.529292 -1.785054 0.425915
C  -3.769631 -0.551122 0.583447
C  -4.814884 0.321557 -0.081135
C  -4.192569 -1.946313 0.726068
C  -4.422448 1.567444 -0.562426
C  -6.141435 -0.070843 -0.159825
C  -5.366951 2.414865 -1.122783
C  -7.076134 0.789294 -0.721504
C  -6.700846 2.028538 -1.200611
C  -3.93029 4.297666 -1.298012
C  -3.09245 4.744652 -2.308802
C  -3.656152 4.595947 0.030817
C  -1.979371 5.507781 -1.987102
C  -2.533902 5.348518 0.33943
C  -1.693491 5.809441 -0.664314
H  1.100863 0.590815 0.902509
H  -0.461483 -0.850779 -1.354901
H  2.02225 -1.079485 -1.51763
H  1.564574 1.876484 -2.701821
H  0.989648 0.22848 -2.932358
H  -0.123884 1.572483 -3.107532
H  -0.270442 2.514185 0.535645
H  0.771213 3.234017 -0.682247
H  -0.915431 2.910198 -1.057815
H  -3.566085 -0.165457 1.588521
H  -3.387838 1.8800 -0.507882
H  -6.45682 -1.03908 0.20523
H  -8.111738 0.484117 -0.785695
H  -7.425505 2.699574 -1.642045
H  -3.32504 4.507724 -3.338756
H  -4.317527 4.253333 0.816356
H  -1.331695 5.863256 -2.777526
H  -2.32244 5.58344 1.374063
H  -0.823841 6.402332 -0.415854
nucrepener: 5610.93111882 hartree
xcener: -389.811445875256 hartree
chargesum: 0.0000000
charge: -0.061772 0.001094 -0.001394 0.007314 -0.260554 -0.355614 -0.292073 -0.000996 0.116143 -0.069599 -0.169082 -0.182858 -0.254249 -0.240256 0.332737 0.034991 0.354564 -0.040520 -0.267249 -0.158431 -0.181719 0.259154 -0.068576 -0.218221 0.229624 -0.179845 -0.164718 -0.107626 -0.105148 -0.146888 0.122146 0.103779 0.149063 0.100795 0.078581 0.104574 0.106805 0.100948 0.046173 0.135026 0.110618 0.127897 0.130076 0.128196 0.126291 0.134826 0.127020 0.130288 0.128663
qa: -0.0618 0.0011 -0.0014 0.0073 -0.2606 -0.3556 -0.2921 -0.0010 0.1161 -0.0696 -0.1691 -0.1829 -0.2542 -0.2403 0.3327 0.0350 0.3546 -0.0405 -0.2672 -0.1584 -0.1817 0.2592 -0.0686 -0.2182 0.2296 -0.1798 -0.1647 -0.1076 -0.1051 -0.1469 0.1221 0.1038 0.1491 0.1008 0.0786 0.1046 0.1068 0.1009 0.0462 0.1350 0.1106 0.1279 0.1301 0.1282 0.1263 0.1348 0.1270 0.1303 0.1287
va: 1.2026 1.2344 1.2388 1.2401 2.1130 2.1518 2.1232 3.1137 3.8484 3.7199 3.9199 4.1192 3.9041 3.8966 4.2292 4.3589 3.7861 3.8962 4.0409 3.9461 3.9963 3.8132 3.9671 4.0368 3.8085 3.9859 3.9584 3.8937 3.9011 3.9098 1.0443 1.0298 1.0031 1.0077 1.0088 1.0042 1.0191 1.0081 1.0123 1.0238 1.0013 1.0228 0.9996 1.0140 1.0132 1.0023 1.0003 0.9998 1.0011
dispcorr: -0.032064302 hartree
energy: -11427.145910828005
dipole: -142.02723 141.93691 -0.09032 98.45652 -96.70559 1.75093 -33.29252 32.41016 -0.88235
magnitude: 1.96277 au
magnitude: 4.98895 debye
