program: Orca
programVersion: 5.0.2
elementType: Br Br Br Br O O O N C C C C C C C C C C C C C C C C C C C C C C H H H H H H H H H H H H H H H H H H H
charge: 0
multiplicity: 1
keywords: wb97x-d3
keywords: def2-TZVPP
keywords: def2/J RIJCOSX
keywords: DEFGRID2
keywords: scfconv7
keywords: smallprint printgap noloewdin
keywords: NOSOSCF
formula: C22H19Br4NO3
InChI: InChI=1/C22H19Br4NO3/c1-21(2)17(19(23)22(24,25)26)18(21)20(28)30-16(12-27)13-7-6-10-15(11-13)29-14-8-4-3-5-9-14/h3-11,16-19H,1-2H3
49 atoms
Br 3.444696 -2.952538 -0.452991
Br 1.476117 -1.052115 -2.536594
Br 0.864714 0.897458 -0.16261
Br 3.830296 0.420023 -1.05948
O  -1.92507 -1.859957 0.702511
O  -1.733295 -0.518676 2.483956
O  -2.791776 3.600427 -0.182128
N  -4.538367 -3.114357 -0.874157
C  0.708245 -3.155575 1.698114
C  0.907063 -2.208671 0.557685
C  0.162281 -1.744647 1.787135
C  2.221736 -1.574964 0.21047
C  1.836538 -3.462355 2.656515
C  -0.199324 -4.34022 1.468679
C  -1.248391 -1.31003 1.724922
C  2.11262 -0.435555 -0.819619
C  -3.17661 -1.264503 0.369101
C  -2.941521 -0.047097 -0.489921
C  -3.933019 -2.304431 -0.329772
C  -3.048454 1.211989 0.085614
C  -2.521597 -0.192548 -1.80486
C  -2.743961 2.336305 -0.673106
C  -2.212495 0.936063 -2.546125
C  -2.323542 2.198334 -1.99052
C  -3.527697 3.870146 0.941057
C  -4.904662 3.691962 0.950593
C  -2.869841 4.374642 2.050545
C  -5.62227 4.020404 2.089674
C  -3.600636 4.708451 3.181634
C  -4.974945 4.528723 3.207376
H  0.28606 -2.428489 -0.30395
H  0.715345 -1.107654 2.468706
H  2.701009 -1.154672 1.098483
H  2.44131 -4.292265 2.291825
H  2.502719 -2.615673 2.821966
H  1.428751 -3.746846 3.62752
H  -0.991634 -4.145652 0.750618
H  0.388192 -5.17778 1.09011
H  -0.663686 -4.65716 2.403882
H  -3.729787 -0.994495 1.273582
H  -3.34725 1.308501 1.121279
H  -2.436999 -1.17489 -2.25151
H  -1.881725 0.833056 -3.5705
H  -2.08354 3.081785 -2.567078
H  -5.409838 3.30539 0.074483
H  -1.796502 4.508046 2.022175
H  -6.695464 3.88399 2.100043
H  -3.08878 5.105437 4.048094
H  -5.540654 4.786718 4.092284
nucrepener: 5876.70806868 hartree
xcener: -389.816284762172 hartree
chargesum: 0.0000000
charge: -0.060316 -0.011200 -0.010206 0.005441 -0.262057 -0.345064 -0.292704 0.000215 0.084358 -0.080317 -0.120284 -0.185115 -0.251234 -0.243515 0.325571 0.069589 0.302225 0.023416 -0.271474 -0.139697 -0.210251 0.214493 -0.077505 -0.191496 0.219495 -0.162190 -0.171140 -0.118488 -0.105344 -0.126872 0.112342 0.100750 0.146142 0.100224 0.076296 0.105705 0.095351 0.094470 0.094184 0.124748 0.129671 0.116327 0.126309 0.127382 0.133375 0.124066 0.129578 0.126728 0.128017
qa: -0.0603 -0.0112 -0.0102 0.0054 -0.2621 -0.3451 -0.2927 0.0002 0.0844 -0.0803 -0.1203 -0.1851 -0.2512 -0.2435 0.3256 0.0696 0.3022 0.0234 -0.2715 -0.1397 -0.2103 0.2145 -0.0775 -0.1915 0.2195 -0.1622 -0.1711 -0.1185 -0.1053 -0.1269 0.1123 0.1008 0.1461 0.1002 0.0763 0.1057 0.0954 0.0945 0.0942 0.1247 0.1297 0.1163 0.1263 0.1274 0.1334 0.1241 0.1296 0.1267 0.1280
va: 1.2018 1.2273 1.2377 1.2397 2.0975 2.1534 2.1140 3.1119 3.8594 3.6767 3.8826 4.1264 3.9134 3.9086 4.2467 4.3121 3.8476 3.6149 4.0186 3.8758 4.0037 3.8534 3.9187 4.0175 3.8266 3.9774 4.0397 3.9450 3.9450 3.9516 1.0453 1.0268 1.0019 1.0072 1.0067 1.0046 1.0155 1.0039 1.0023 1.0177 1.0269 1.0186 1.0008 1.0132 1.0040 1.0124 0.9995 0.9996 0.9998
dispcorr: -0.033983556 hartree
energy: -11427.145148960721
dipole: -112.87147 113.32716 0.45569 16.92667 -16.40187 0.52479 57.27366 -56.41111 0.86255
magnitude: 1.10772 au
magnitude: 2.81561 debye
