program: Orca
programVersion: 5.0.2
elementType: Br Br Br Br O O O N C C C C C C C C C C C C C C C C C C C C C C H H H H H H H H H H H H H H H H H H H
charge: 0
multiplicity: 1
keywords: wb97x-d3
keywords: def2-TZVPP
keywords: def2/J RIJCOSX
keywords: DEFGRID2
keywords: scfconv7
keywords: smallprint printgap noloewdin
keywords: NOSOSCF
formula: C22H19Br4NO3
InChI: InChI=1/C22H19Br4NO3/c1-21(2)17(19(23)22(24,25)26)18(21)20(28)30-16(12-27)13-7-6-10-15(11-13)29-14-8-4-3-5-9-14/h3-11,16-19H,1-2H3
49 atoms
Br 3.871878 -1.027937 0.33109
Br 1.68541 1.6095 0.475994
Br -0.494983 -0.269571 1.721309
Br 2.262175 0.093828 3.16938
O  -2.18164 -2.78812 -0.769406
O  -1.282504 -1.236141 -2.108946
O  -3.731269 2.629759 -0.626683
N  -4.216435 -2.202706 -3.498307
C  1.404349 -2.788405 -1.421926
C  1.254956 -1.530696 -0.629769
C  0.119518 -2.525768 -0.662633
C  1.958168 -1.264243 0.667869
C  2.237528 -3.936663 -0.90208
C  1.449534 -2.656167 -2.92471
C  -1.149574 -2.094836 -1.284112
C  1.415506 -0.044814 1.435832
C  -3.495997 -2.289414 -0.989529
C  -3.714868 -1.003207 -0.22873
C  -3.849024 -2.213082 -2.410341
C  -3.666366 0.234587 -0.848889
C  -3.894282 -1.093626 1.148371
C  -3.768664 1.389126 -0.079917
C  -4.020988 0.062733 1.900532
C  -3.948239 1.306561 1.293658
C  -2.917768 2.876524 -1.7014
C  -3.424691 3.67589 -2.713792
C  -1.617517 2.393141 -1.761827
C  -2.618894 3.995982 -3.795985
C  -0.828909 2.710237 -2.855832
C  -1.322104 3.511459 -3.875193
H  1.095671 -0.648325 -1.241923
H  -0.010313 -3.140604 0.220957
H  1.877967 -2.123201 1.339205
H  3.281537 -3.81874 -1.19152
H  2.205121 -4.037811 0.182932
H  1.876843 -4.875466 -1.324635
H  2.479172 -2.491275 -3.244972
H  1.095115 -3.571048 -3.401947
H  0.846872 -1.831162 -3.296454
H  -4.137943 -3.064548 -0.563778
H  -3.533806 0.304543 -1.920846
H  -3.936078 -2.061674 1.63215
H  -4.168345 -0.001824 2.970267
H  -4.029483 2.214746 1.875746
H  -4.440323 4.043211 -2.648648
H  -1.221388 1.771093 -0.969921
H  -3.014237 4.620188 -4.586273
H  0.18115 2.325678 -2.90575
H  -0.700306 3.75508 -4.725867
nucrepener: 6005.53005392 hartree
xcener: -389.818593607522 hartree
chargesum: -0.0000000
charge: -0.059149 -0.007370 -0.024966 0.005285 -0.265218 -0.363353 -0.298149 0.009249 0.080132 -0.092350 -0.099019 -0.181725 -0.246854 -0.244202 0.332052 0.082364 0.385591 -0.007685 -0.281392 -0.131905 -0.247645 0.224097 -0.114437 -0.176577 0.217401 -0.199741 -0.086101 -0.097568 -0.091849 -0.135122 0.109757 0.094483 0.145933 0.101882 0.074403 0.104153 0.094836 0.091960 0.101147 0.123155 0.147321 0.110661 0.131546 0.128708 0.124023 0.070125 0.124488 0.113719 0.123904
qa: -0.0591 -0.0074 -0.0250 0.0053 -0.2652 -0.3634 -0.2981 0.0092 0.0801 -0.0923 -0.0990 -0.1817 -0.2469 -0.2442 0.3321 0.0824 0.3856 -0.0077 -0.2814 -0.1319 -0.2476 0.2241 -0.1144 -0.1766 0.2174 -0.1997 -0.0861 -0.0976 -0.0918 -0.1351 0.1098 0.0945 0.1459 0.1019 0.0744 0.1042 0.0948 0.0920 0.1011 0.1232 0.1473 0.1107 0.1315 0.1287 0.1240 0.0701 0.1245 0.1137 0.1239
va: 1.2038 1.2335 1.2375 1.2409 2.1179 2.1160 2.1206 3.1134 3.8890 3.7250 3.8838 4.1154 3.9014 3.9040 4.1871 4.2989 3.9345 3.5983 4.0275 3.9221 3.9816 3.8830 3.8954 3.9995 3.8719 4.0268 3.9291 3.9439 3.9382 3.9746 1.0415 1.0335 1.0018 1.0071 1.0067 1.0055 1.0023 1.0027 1.0220 0.9923 1.0120 1.0174 1.0004 1.0115 1.0136 1.0275 0.9991 1.0038 1.0005
dispcorr: -0.035611389 hartree
energy: -11427.146389728636
dipole: -81.98644 82.50869 0.52224 -17.06769 16.26140 -0.80628 -73.73318 74.90275 1.16957
magnitude: 1.51351 au
magnitude: 3.84704 debye
