program: Orca
programVersion: 5.0.2
elementType: O O O O N C C C C C C C C C C C C C C C C C C C H H H H H H H H H H H H H H H H H H H H H H H H H
charge: 0
multiplicity: 1
keywords: wb97x-d3
keywords: def2-TZVPP
keywords: def2/J RIJCOSX
keywords: DEFGRID2
keywords: scfconv7
keywords: smallprint printgap noloewdin
keywords: NOSOSCF
formula: C19H25NO4
InChI: InChI=1/C19H25NO4/c1-11(2)9-14-15(19(14,3)4)18(23)24-10-20-16(21)12-7-5-6-8-13(12)17(20)22/h9,14-15H,5-8,10H2,1-4H3
49 atoms
O  1.192949 -1.855382 -1.123482
O  1.235662 -1.250403 1.027878
O  -1.180247 -0.654263 -2.693126
O  -1.57754 -2.241328 1.549855
N  -1.119755 -1.737093 -0.660513
C  4.00511 0.006902 0.433172
C  3.024021 1.040183 0.009005
C  2.88217 -0.40601 -0.498211
C  5.364975 0.035612 -0.225773
C  4.064564 -0.470914 1.863124
C  2.02813 1.643372 0.924709
C  1.719974 -1.193319 -0.077365
C  0.927467 2.265247 0.492685
C  -0.002703 -2.592391 -0.9195
C  -0.03551 2.912139 1.436953
C  0.589609 2.343702 -0.969913
C  -2.509289 0.098084 -0.811962
C  -2.630372 -0.378844 0.427565
C  -3.223768 1.282701 -1.345568
C  -3.532542 0.168337 1.468528
C  -3.870088 2.051409 -0.191207
C  -4.538543 1.118131 0.817535
C  -1.54687 -0.755235 -1.548199
C  -1.734809 -1.551769 0.574572
H  3.356436 1.702639 -0.786709
H  3.166326 -0.55982 -1.53225
H  5.311409 0.39518 -1.253936
H  6.041977 0.693236 0.322359
H  5.809401 -0.961201 -0.242626
H  3.11551 -0.431308 2.388623
H  4.426695 -1.499325 1.90753
H  4.77136 0.148017 2.41848
H  2.223911 1.59867 1.99126
H  0.091852 -3.307369 -0.103168
H  -0.154829 -3.140715 -1.845195
H  0.275914 2.814023 2.476639
H  -0.143169 3.976728 1.213129
H  -1.033794 2.476454 1.3372
H  -0.330451 2.902522 -1.14122
H  1.38085 2.832182 -1.54358
H  0.459835 1.351547 -1.407114
H  -2.530791 1.921951 -1.898209
H  -3.978256 0.957992 -2.068811
H  -4.042779 -0.64361 1.991832
H  -2.937237 0.689838 2.224911
H  -3.104246 2.643167 0.31833
H  -4.599638 2.758104 -0.587753
H  -5.309622 0.530484 0.311539
H  -5.043201 1.700315 1.589014
elementType: O N C H
totalener: -1094.86574341 hartree
nucrepener: 2243.27502442 hartree
electener: -3338.14076783 hartree
oneelecener: -5949.28106778 hartree
twoeener: 2611.14029994 hartree
cpcmener: -0.04210715 hartree
kineticenergy: 1090.05130903 hartree
xcener: -105.977982867408 hartree
chargesum: 0.0000000
charge: -0.291204 -0.483858 -0.432393 -0.428918 -0.095592 0.131337 -0.026699 -0.106180 -0.264138 -0.294938 -0.262437 0.415329 -0.007609 0.088091 -0.211957 -0.306243 -0.074965 -0.047560 -0.080497 -0.085883 -0.156993 -0.121346 0.298791 0.328361 0.116923 0.093687 0.087864 0.095172 0.096706 0.091049 0.102513 0.100152 0.128846 0.132863 0.142705 0.092721 0.104215 0.069349 0.103984 0.118788 0.092946 0.097886 0.111451 0.099223 0.104146 0.088325 0.086284 0.078672 0.081032
qa: -0.2912 -0.4839 -0.4324 -0.4289 -0.0956 0.1313 -0.0267 -0.1062 -0.2641 -0.2949 -0.2624 0.4153 -0.0076 0.0881 -0.2120 -0.3062 -0.0750 -0.0476 -0.0805 -0.0859 -0.1570 -0.1213 0.2988 0.3284 0.1169 0.0937 0.0879 0.0952 0.0967 0.0910 0.1025 0.1002 0.1288 0.1329 0.1427 0.0927 0.1042 0.0693 0.1040 0.1188 0.0929 0.0979 0.1115 0.0992 0.1041 0.0883 0.0863 0.0787 0.0810
va: 2.1037 2.0046 2.0674 2.0790 3.0788 3.7752 3.8012 3.8390 3.8966 3.8904 3.7877 4.0740 3.6437 3.9039 3.9172 3.9646 3.6478 3.6086 3.8986 3.9151 3.9161 3.9035 4.1664 4.1877 1.0040 1.0319 1.0047 1.0022 1.0023 1.0181 0.9998 0.9991 1.0004 1.0146 0.9945 1.0121 0.9948 0.9951 1.0015 1.0023 1.0005 1.0112 1.0059 1.0159 1.0026 1.0037 1.0122 1.0070 1.0104
dispcorr: -0.028972940 hartree
energy: -1094.894716354429
dipole: 6.89930 -7.48185 -0.58254 20.62534 -19.11341 1.51194 5.72509 -6.31787 -0.59277
magnitude: 1.72531 au
magnitude: 4.38539 debye
