program: Orca
programVersion: 5.0.2
elementType: O O O O N C C C C C C C C C C C C C C C C C C C H H H H H H H H H H H H H H H H H H H H H H H H H
charge: 0
multiplicity: 1
keywords: wb97x-d3
keywords: def2-TZVPP
keywords: def2/J RIJCOSX
keywords: DEFGRID2
keywords: scfconv7
keywords: smallprint printgap noloewdin
keywords: NOSOSCF
formula: C19H25NO4
InChI: InChI=1/C19H25NO4/c1-11(2)9-14-15(19(14,3)4)18(23)24-10-20-16(21)12-7-5-6-8-13(12)17(20)22/h9,14-15H,5-8,10H2,1-4H3
49 atoms
O  1.166071 -1.005899 -0.5292
O  2.681605 -2.138365 -1.697267
O  -1.495762 0.357088 -2.298757
O  -1.200757 -2.308939 1.364329
N  -1.106205 -1.229534 -0.670928
C  3.485044 -0.189656 1.307773
C  3.267362 0.923297 0.343309
C  3.44704 -0.499392 -0.182635
C  4.851679 -0.319488 1.937887
C  2.374402 -0.622818 2.232858
C  1.994935 1.688944 0.295471
C  2.416491 -1.289088 -0.871153
C  1.476309 2.268755 -0.788656
C  0.123674 -1.758133 -1.146926
C  0.24647 3.119613 -0.702201
C  2.059986 2.123993 -2.159551
C  -2.857701 0.222155 -0.299456
C  -2.780653 -0.572443 0.769619
C  -3.865572 1.29184 -0.496202
C  -3.703994 -0.537276 1.928798
C  -4.583706 1.568155 0.826454
C  -4.944414 0.280556 1.566084
C  -1.772673 -0.148337 -1.239539
C  -1.629941 -1.488847 0.592215
H  4.148636 1.525362 0.134805
H  4.420413 -0.695796 -0.616915
H  5.643705 0.00628 1.262953
H  4.914023 0.288937 2.842155
H  5.055842 -1.35409 2.219723
H  2.451446 -0.06662 3.169167
H  1.374938 -0.454639 1.841901
H  2.464959 -1.682801 2.475679
H  1.486308 1.830825 1.245077
H  0.197817 -2.811738 -0.880616
H  0.158796 -1.660738 -2.230931
H  0.480985 4.158882 -0.947961
H  -0.513056 2.800776 -1.4190
H  -0.196894 3.102727 0.293291
H  1.349108 1.621915 -2.821928
H  2.255743 3.102436 -2.605579
H  2.989845 1.558162 -2.175348
H  -3.387248 2.197517 -0.876627
H  -4.576885 0.97914 -1.266948
H  -3.977533 -1.55221 2.225954
H  -3.187262 -0.099593 2.788652
H  -3.940204 2.181392 1.462982
H  -5.484212 2.1526 0.635203
H  -5.603268 -0.325898 0.938679
H  -5.50352 0.514577 2.472559
elementType: O N C H
totalener: -1094.86549477 hartree
nucrepener: 2206.37273042 hartree
electener: -3301.23822519 hartree
oneelecener: -5874.72641856 hartree
twoeener: 2573.48819336 hartree
cpcmener: -0.03738772 hartree
kineticenergy: 1090.04931352 hartree
xcener: -105.975772942162 hartree
chargesum: -0.0000000
charge: -0.255537 -0.503741 -0.434341 -0.434652 -0.090142 0.147058 -0.010862 -0.156165 -0.270111 -0.292115 -0.259152 0.442979 -0.034378 0.064760 -0.238024 -0.259284 -0.037980 -0.040581 -0.072402 -0.075412 -0.132350 -0.135085 0.289071 0.313674 0.115939 0.096703 0.088344 0.093950 0.096461 0.101614 0.080469 0.105659 0.125952 0.141519 0.132492 0.110193 0.080407 0.093103 0.093090 0.107612 0.093949 0.095980 0.104633 0.094643 0.102993 0.078670 0.080612 0.078802 0.080983
qa: -0.2555 -0.5037 -0.4343 -0.4347 -0.0901 0.1471 -0.0109 -0.1562 -0.2701 -0.2921 -0.2592 0.4430 -0.0344 0.0648 -0.2380 -0.2593 -0.0380 -0.0406 -0.0724 -0.0754 -0.1323 -0.1351 0.2891 0.3137 0.1159 0.0967 0.0883 0.0940 0.0965 0.1016 0.0805 0.1057 0.1260 0.1415 0.1325 0.1102 0.0804 0.0931 0.0931 0.1076 0.0939 0.0960 0.1046 0.0946 0.1030 0.0787 0.0806 0.0788 0.0810
va: 2.1058 1.9940 2.0621 2.0681 3.1429 3.7042 3.7917 3.8903 3.9069 3.9172 3.8312 4.0611 3.6884 3.9014 3.9169 3.9408 3.6871 3.7027 3.9147 3.9146 3.9139 3.9186 4.1645 4.1637 1.0048 1.0281 1.0053 1.0019 1.0012 1.0000 1.0040 1.0009 0.9979 0.9997 1.0069 0.9970 1.0074 1.0057 1.0046 0.9998 1.0050 1.0117 1.0050 1.0141 1.0049 1.0073 1.0095 1.0065 1.0097
dispcorr: -0.027510932 hartree
energy: -1094.893005705343
dipole: 2.75984 -4.51867 -1.75884 16.76716 -15.05826 1.70890 9.68009 -8.24702 1.43307
magnitude: 2.84034 au
magnitude: 7.21957 debye
