program: Gaussian 09
title: 000067984
version: EM64L-G09RevD.01
frameworkgroup: C1[X(C7H8FN)]
method: RPBEPBE
basis: SDD
operation: Freq
keyword: #pfreq=noraman
keyword: PBEPBE/SDD
title: #p freq=noraman PBEPBE/SDD
converged: YES YES NO NO
title: Mulliken charges:
elementType: F N C C C C C C C H H H H H H H H
charge: -0.231706 -0.684245 0.493197 0.289728 -0.480897 -0.425472 0.192840 -0.352832 -0.806371 0.250004 0.225985 0.220084 0.226889 0.228967 0.222326 0.325618 0.305887
chargesum: 0.00000
title: Mulliken charges with hydrogens summed into heavy atoms:
elementType: F N C C C C C C C
charge: -0.231706 -0.052740 0.493197 0.289728 -0.230894 -0.199487 0.192840 -0.132749 -0.128189
polarizability: 1.18320790e+02 4.97649516e+00 8.68005288e+01 -7.56581244e-02 -1.90571988e-02 3.97851393e+01
1716.lowfreq: -12.4024 -0.0005 -0.0004 0.0003 6.9796 12.9429 47.3107 138.0879 213.2708
frequency: 47.0903 138.0848 213.2694 273.1854 281.7989 322.6117 350.4379 421.8555 428.4911 440.2109 479.6501 544.0378 576.6214 703.6606 707.4495 783.5163 803.2452 859.3659 910.9390 928.7967 994.1092 1024.1303 1045.3868 1101.3523 1155.7232 1223.2998 1277.9453 1332.5828 1379.0073 1398.6960 1435.9994 1470.3607 1477.9040 1528.7061 1580.6190 1621.5865 1656.5234 2971.7309 3047.5428 3080.3599 3120.6331 3143.7152 3152.0418 3574.4066 3718.0390
redmass: 1.0487 3.5071 4.9956 5.1720 2.8085 1.5542 2.1939 1.4949 4.7002 1.6773 4.4918 5.7656 3.6676 6.2458 3.6596 4.4791 1.4098 1.3576 3.5595 1.3361 1.5623 1.5106 1.4938 2.2709 1.2533 2.1713 1.5872 3.1302 3.9740 1.2604 4.7373 1.0458 1.1155 3.7742 6.2057 1.2864 4.8582 1.0373 1.0978 1.0983 1.0871 1.0961 1.0929 1.0446 1.1046
irintensity: 0.5205 3.7063 5.1717 2.8209 5.2008 102.7670 116.3375 83.2077 1.1252 36.9612 2.2708 2.1946 13.1564 3.0564 0.1491 14.4276 52.9180 14.9259 12.6542 1.3150 7.5872 0.8659 11.0526 44.3819 14.1243 27.5549 0.9116 63.6536 6.3803 4.8681 3.9900 12.5787 17.7692 194.3948 5.4245 75.5744 139.4241 51.6255 25.4054 20.9479 16.2079 24.9874 0.8102 88.5187 33.3687
temp: 298.150 k
press: 1.00000 atm
elementType: 9 7 6 6 6 6 6 6 6 1 1 1 1 1 1 1 1
symmnumber: 1
zpe: 351263.8 jmol-1
zpe.correction: 0.133789 hartree
zpe.thermalcorrener: 0.142544 hartree
zpe.thermalcorrenthalpy: 0.143489 hartree
zpe.thermalcorrgfe: 0.100231 hartree
zpe.sumelectzpe: -425.485507 hartree
zpe.sumelectthermal: -425.476752 hartree
zpe.sumelectthermalent: -425.475808 hartree
zpe.sumelectthermalfe: -425.519065 hartree
dipole: 0.3962 1.7787 0.0134
dipole: 1.8224
quadrupole: -41.7067 -49.0369 -56.8966
quadrupole: 5.8160 -0.0122 -0.0018
quadrupole: 7.5067 0.1765 -7.6832 5.8160 -0.0122 -0.0018
hfenergy: -425.6192965 hartree
pointgroup: C01 [X(C7H8F1N1)]
dipole: -0.1407621 -0.7025434 -0.0257841 debye
dipolederiv: -0.6140162 0.4045517 0.0235736 0.4308932 -0.6774763 -0.0287599 0.0246428 -0.0271888 -0.1492138 -1.5319528 -0.2417282 -0.0038749 -0.2568174 -0.1638778 0.0294303 -0.0040262 0.0293358 -0.7449963 0.1625871 0.0582204 0.0025278 0.1678188 -0.1301389 -0.0038563 0.0266136 0.0016461 -0.07807 1.5002476 0.2900169 -0.00126 0.434789 -0.1257272 -0.0150266 0.0045574 -0.0133151 0.1014094 -0.0359776 -0.0670112 -0.0033751 0.0222574 0.0158203 0.0096621 -0.0023733 0.0106917 -0.1541646 0.0210283 0.1230345 0.0042475 -0.1336237 0.1257511 0.0139779 -0.0090714 0.0110539 -0.1684742 0.3080338 -0.3085852 -0.0173781 -0.828939 0.6993437 0.0384607 -0.0417076 0.031777 0.0213726 -0.2901681 -0.1992377 -0.0086657 0.243319 0.1074174 0.0135629 0.0106693 0.0171695 -0.2104658 -0.024585 -0.0313724 -0.000049 -0.0892789 0.052422 -0.0002042 -0.0229203 -0.0062831 0.0868702 0.0944652 -0.0513586 -0.0009972 -0.0420395 -0.0505085 -0.0099744 -0.0003087 -0.009016 0.1694481 -0.0232302 0.1154039 0.0079063 0.1046284 -0.0170256 -0.0086249 0.0078766 -0.0095237 0.1549823 0.0288428 -0.0869143 -0.0023733 -0.0749873 -0.0979056 -0.0119911 -0.001172 -0.0120798 0.171811 -0.0125415 -0.0367161 0.0203292 -0.0838612 -0.0020432 0.1231569 0.094179 0.1199445 -0.0272587 -0.0310195 -0.0423919 -0.0353096 -0.0698039 0.0521124 -0.1000147 -0.1130649 -0.1010563 -0.0744783 -0.0057358 0.0520511 0.0099721 0.1620323 -0.0788639 -0.0262598 0.0215217 -0.0196448 0.1048173 0.2473109 -0.003746 0.0015036 -0.0421459 0.1550163 -0.0110243 -0.0001995 -0.0113671 0.4009901 0.2067112 0.0257831 0.0032228 0.0557586 0.1356838 -0.0125147 0.0047834 -0.0121439 0.3954205 unknown
polarizability: 118.0868327|5.6736261|86.9313238|-0.4250121|2.1410898|39.8883013 unknown
InChI: InChI=1S/C7H8FN/c1-5-2-3-7(9)6(8)4-5/h2-4H,9H2,1H3
charge 0 multiplicity 1
17 atoms
F  -1.709046 1.801629 0.109979
N  -2.59913 -0.80516 0.000923
C  1.597082 0.064179 -0.004132
C  -1.228141 -0.564478 -0.002333
C  0.621697 1.096946 0.053399
C  1.132409 -1.273746 -0.061537
C  -0.733556 0.765407 0.053311
C  -0.245019 -1.589408 -0.060563
C  3.079742 0.395111 0.002116
H  0.913135 2.151996 0.098215
H  1.862169 -2.090683 -0.108035
H  -0.566779 -2.636614 -0.106461
H  3.346538 1.088562 -0.817647
H  3.385707 0.87841 0.94985
H  3.691046 -0.516018 -0.118555
H  -3.248705 -0.025547 0.043841
H  -2.961751 -1.751786 -0.038771
