program: Orca
programVersion: 5.0.2
elementType: O O O O N C C C C C C C C C C C C C C C C C C C H H H H H H H H H H H H H H H H H H H H H H H H H
charge: 0
multiplicity: 1
keywords: wb97x-d3
keywords: def2-TZVPP
keywords: def2/J RIJCOSX
keywords: DEFGRID2
keywords: scfconv7
keywords: smallprint printgap noloewdin
keywords: NOSOSCF
formula: C19H25NO4
InChI: InChI=1/C19H25NO4/c1-11(2)9-14-15(19(14,3)4)18(23)24-10-20-16(21)12-7-5-6-8-13(12)17(20)22/h9,14-15H,5-8,10H2,1-4H3
49 atoms
O  1.225146 -1.847435 -1.112716
O  1.259858 -1.326982 1.059287
O  -1.101655 -0.425531 -2.60992
O  -1.600272 -2.290263 1.507602
N  -1.086244 -1.636165 -0.650155
C  4.032587 -0.06263 0.58807
C  3.101358 0.940116 -0.000465
C  2.994839 -0.543564 -0.401958
C  5.444243 -0.072018 0.046868
C  3.976827 -0.427286 2.051534
C  2.025625 1.602858 0.774066
C  1.772522 -1.264749 -0.032543
C  1.023429 2.302844 0.233532
C  -0.01117 -2.526513 -0.958523
C  -0.002097 2.978656 1.090348
C  0.826139 2.471264 -1.240453
C  -2.506771 0.178251 -0.728993
C  -2.654754 -0.37807 0.473815
C  -3.247071 1.367287 -1.216674
C  -3.606027 0.079777 1.514509
C  -3.965852 2.040215 -0.045919
C  -4.629319 1.024611 0.883107
C  -1.502023 -0.607565 -1.486268
C  -1.740779 -1.541474 0.574158
H  3.517167 1.539612 -0.804291
H  3.359378 -0.772797 -1.396135
H  5.899469 -1.05712 0.16307
H  5.477642 0.188219 -1.011563
H  6.064222 0.646761 0.585545
H  2.997177 -0.319593 2.506262
H  4.29944 -1.458953 2.200305
H  4.666237 0.212313 2.605286
H  2.072242 1.532186 1.85601
H  0.041545 -3.29512 -0.1883
H  -0.185679 -3.007707 -1.91732
H  -0.014338 4.056163 0.909184
H  -1.006456 2.615169 0.855512
H  0.175555 2.816262 2.152728
H  -0.156032 2.099379 -1.540521
H  0.843583 3.52905 -1.512455
H  1.572261 1.957627 -1.842433
H  -2.563164 2.065138 -1.706409
H  -3.962445 1.056198 -1.984827
H  -4.099377 -0.776186 1.980406
H  -3.053615 0.583338 2.314096
H  -3.245445 2.632204 0.52555
H  -4.710131 2.738913 -0.429186
H  -5.358027 0.437092 0.317766
H  -5.183054 1.540593 1.667882
elementType: O N C H
totalener: -1094.86641904 hartree
nucrepener: 2234.65553844 hartree
electener: -3329.52195748 hartree
oneelecener: -5932.14976648 hartree
twoeener: 2602.62780900 hartree
cpcmener: -0.04211701 hartree
kineticenergy: 1090.05848337 hartree
xcener: -105.980278357203 hartree
chargesum: -0.0000000
charge: -0.287483 -0.483817 -0.435299 -0.430123 -0.093598 0.145544 -0.033505 -0.110812 -0.263387 -0.294913 -0.262297 0.419071 -0.022169 0.081712 -0.204379 -0.259426 -0.108035 -0.036033 -0.086842 -0.073849 -0.152049 -0.128551 0.321676 0.331705 0.112622 0.094311 0.095941 0.088410 0.095572 0.088575 0.104086 0.098542 0.129905 0.133673 0.144577 0.101576 0.059616 0.093284 0.068186 0.110627 0.095517 0.108339 0.110347 0.095549 0.101598 0.089474 0.086960 0.078322 0.081250
qa: -0.2875 -0.4838 -0.4353 -0.4301 -0.0936 0.1455 -0.0335 -0.1108 -0.2634 -0.2949 -0.2623 0.4191 -0.0222 0.0817 -0.2044 -0.2594 -0.1080 -0.0360 -0.0868 -0.0738 -0.1520 -0.1286 0.3217 0.3317 0.1126 0.0943 0.0959 0.0884 0.0956 0.0886 0.1041 0.0985 0.1299 0.1337 0.1446 0.1016 0.0596 0.0933 0.0682 0.1106 0.0955 0.1083 0.1103 0.0955 0.1016 0.0895 0.0870 0.0783 0.0812
va: 2.1066 2.0082 2.0672 2.0783 3.0836 3.7598 3.7983 3.8499 3.8952 3.8883 3.8308 4.0861 3.6927 3.8979 3.9220 3.9429 3.6773 3.6078 3.9021 3.9107 3.9140 3.9105 4.1588 4.1901 1.0041 1.0312 1.0025 1.0039 1.0021 1.0195 0.9995 0.9996 1.0008 1.0147 0.9939 0.9993 1.0017 1.0101 1.0121 1.0008 1.0092 1.0047 1.0052 1.0155 1.0049 0.9997 1.0108 1.0070 1.0100
dispcorr: -0.028272956 hartree
energy: -1094.894691993479
dipole: 6.63663 -7.29756 -0.66093 20.45599 -19.01183 1.44417 5.59750 -6.19067 -0.59317
magnitude: 1.69537 au
magnitude: 4.30930 debye
