program: Orca
programVersion: 5.0.2
elementType: O O O O N C C C C C C C C C C C C C C C C C C C H H H H H H H H H H H H H H H H H H H H H H H H H
charge: 0
multiplicity: 1
keywords: wb97x-d3
keywords: def2-TZVPP
keywords: def2/J RIJCOSX
keywords: DEFGRID2
keywords: scfconv7
keywords: smallprint printgap noloewdin
keywords: NOSOSCF
formula: C19H25NO4
InChI: InChI=1/C19H25NO4/c1-11(2)9-14-15(19(14,3)4)18(23)24-10-20-16(21)12-7-5-6-8-13(12)17(20)22/h9,14-15H,5-8,10H2,1-4H3
49 atoms
O  0.425597 -0.091458 0.136465
O  2.215405 -0.713222 1.31513
O  -1.386517 -2.650576 -1.039895
O  -2.661794 0.941601 1.431574
N  -1.704284 -0.899615 0.425524
C  3.797921 0.263352 -1.218798
C  3.762525 1.415794 -0.279588
C  2.463153 0.687303 -0.624318
C  3.947749 0.564241 -2.691194
C  4.453244 -1.034553 -0.818056
C  4.382064 1.361456 1.06886
C  1.744607 -0.108147 0.37898
C  3.954961 2.041106 2.135682
C  -0.408542 -0.855649 1.005681
C  4.668125 1.961877 3.450459
C  2.732785 2.905054 2.124333
C  -3.454733 -1.389682 -0.991106
C  -3.826079 -0.331005 -0.269471
C  -4.294112 -2.066016 -2.010155
C  -5.133599 0.36022 -0.379806
C  -5.744715 -1.603762 -1.862215
C  -5.844188 -0.09271 -1.656989
C  -2.077946 -1.769447 -0.594255
C  -2.71403 0.031931 0.64266
H  3.801001 2.393967 -0.752145
H  1.808273 1.212769 -1.308968
H  3.474895 1.508454 -2.963076
H  5.003268 0.6300 -2.961654
H  3.49811 -0.222983 -3.299127
H  5.505883 -1.010866 -1.105373
H  4.412419 -1.244687 0.247235
H  3.992419 -1.873887 -1.341455
H  5.268884 0.742543 1.17256
H  -0.469072 -0.389249 1.988799
H  -0.030312 -1.870825 1.118522
H  5.534544 1.302599 3.409747
H  5.008392 2.949299 3.771745
H  4.000511 1.596085 4.234479
H  2.292772 3.017906 1.135303
H  1.96657 2.491093 2.78535
H  2.959396 3.903117 2.506621
H  -3.911017 -1.828277 -3.007357
H  -4.216634 -3.150662 -1.907243
H  -5.738244 0.129129 0.502702
H  -4.993185 1.44352 -0.37415
H  -6.313266 -1.900106 -2.744186
H  -6.199241 -2.114837 -1.009245
H  -6.890715 0.211306 -1.617795
H  -5.400991 0.418948 -2.515612
elementType: O N C H
totalener: -1094.86755316 hartree
nucrepener: 2074.62913033 hartree
electener: -3169.49668349 hartree
oneelecener: -5611.82768517 hartree
twoeener: 2442.33100168 hartree
cpcmener: -0.03834306 hartree
kineticenergy: 1090.03600085 hartree
xcener: -105.972603928846 hartree
chargesum: -0.0000000
charge: -0.287867 -0.493590 -0.433935 -0.433448 -0.115940 0.129703 -0.012754 -0.094231 -0.265019 -0.295981 -0.285825 0.412947 -0.019718 0.087604 -0.224150 -0.268462 -0.065283 -0.074170 -0.072646 -0.071929 -0.134681 -0.135102 0.338216 0.340570 0.117475 0.096481 0.088680 0.094045 0.096634 0.101166 0.093234 0.102809 0.125705 0.135676 0.128947 0.089844 0.096397 0.094494 0.095348 0.100202 0.106597 0.102882 0.093869 0.102031 0.094592 0.081260 0.078235 0.080836 0.078253
qa: -0.2879 -0.4936 -0.4339 -0.4334 -0.1159 0.1297 -0.0128 -0.0942 -0.2650 -0.2960 -0.2858 0.4129 -0.0197 0.0876 -0.2241 -0.2685 -0.0653 -0.0742 -0.0726 -0.0719 -0.1347 -0.1351 0.3382 0.3406 0.1175 0.0965 0.0887 0.0940 0.0966 0.1012 0.0932 0.1028 0.1257 0.1357 0.1289 0.0898 0.0964 0.0945 0.0953 0.1002 0.1066 0.1029 0.0939 0.1020 0.0946 0.0813 0.0782 0.0808 0.0783
va: 2.1024 1.9867 2.0762 2.0777 3.1392 3.7403 3.8169 3.8529 3.9021 3.8981 3.8496 4.0402 3.7068 3.8892 3.9243 3.9425 3.6790 3.6994 3.9206 3.9188 3.9160 3.9177 4.1887 4.1877 1.0048 1.0285 1.0046 1.0021 1.0021 0.9981 1.0138 1.0005 0.9990 1.0020 1.0039 1.0067 0.9966 0.9966 1.0052 0.9981 0.9997 1.0047 1.0148 1.0043 1.0149 1.0094 1.0069 1.0094 1.0068
dispcorr: -0.022973434 hartree
energy: -1094.890526594270
dipole: 13.65723 -15.36598 -1.70875 8.94194 -8.32952 0.61242 -3.77547 2.37307 -1.40240
magnitude: 2.29382 au
magnitude: 5.83043 debye
