program: Orca
programVersion: 5.0.2
elementType: O O O O N C C C C C C C C C C C C C C C C C C C H H H H H H H H H H H H H H H H H H H H H H H H H
charge: 0
multiplicity: 1
keywords: wb97x-d3
keywords: def2-TZVPP
keywords: def2/J RIJCOSX
keywords: DEFGRID2
keywords: scfconv7
keywords: smallprint printgap noloewdin
keywords: NOSOSCF
formula: C19H25NO4
InChI: InChI=1/C19H25NO4/c1-11(2)9-14-15(19(14,3)4)18(23)24-10-20-16(21)12-7-5-6-8-13(12)17(20)22/h9,14-15H,5-8,10H2,1-4H3
49 atoms
O  1.160313 -1.370532 -0.400013
O  2.584481 -2.703789 -1.470786
O  -1.244773 -0.277197 -2.406385
O  -1.4552 -2.106489 1.745357
N  -1.123535 -1.506081 -0.458216
C  3.574562 0.078339 0.722674
C  3.153583 0.825188 -0.49957
C  3.409044 -0.673992 -0.591347
C  5.010724 0.245142 1.162036
C  2.636818 -0.149258 1.883793
C  1.805385 1.410358 -0.721117
C  2.367164 -1.676951 -0.86249
C  1.259049 2.394613 -0.003649
C  0.070139 -2.227771 -0.731829
C  -0.102004 2.928315 -0.335726
C  1.926702 3.046052 1.16735
C  -2.727597 0.146847 -0.540451
C  -2.799343 -0.401567 0.673953
C  -3.593227 1.242831 -1.036695
C  -3.782739 -0.028972 1.719282
C  -4.350331 1.864633 0.137714
C  -4.900814 0.802376 1.088004
C  -1.637318 -0.516927 -1.291707
C  -1.744602 -1.43705 0.78596
H  3.954642 1.38754 -0.974964
H  4.339024 -0.95632 -1.070438
H  5.111474 1.124573 1.801547
H  5.349237 -0.621483 1.733037
H  5.685073 0.370891 0.314219
H  2.770534 -1.149998 2.298503
H  2.872028 0.561012 2.677515
H  1.587344 -0.020466 1.636778
H  1.254367 1.041313 -1.580505
H  0.094552 -3.134228 -0.12842
H  0.093753 -2.501237 -1.785672
H  -0.528911 2.449113 -1.216887
H  -0.791876 2.778728 0.499678
H  -0.06912 4.005469 -0.518288
H  1.993434 4.125606 1.008736
H  1.342149 2.906063 2.08002
H  2.933505 2.675376 1.349701
H  -2.990928 1.993948 -1.553516
H  -4.288763 0.845379 -1.782491
H  -4.183254 -0.924605 2.199447
H  -3.276243 0.536739 2.507526
H  -3.675599 2.527099 0.687531
H  -5.16213 2.486511 -0.240803
H  -5.574686 0.139184 0.538214
H  -5.494549 1.271669 1.873167
elementType: O N C H
totalener: -1094.86475360 hartree
nucrepener: 2212.28135006 hartree
electener: -3307.14610366 hartree
oneelecener: -5886.19513671 hartree
twoeener: 2579.04903305 hartree
cpcmener: -0.03803732 hartree
kineticenergy: 1090.04508479 hartree
xcener: -105.976202578058 hartree
chargesum: 0.0000000
charge: -0.256890 -0.500808 -0.433224 -0.434747 -0.092533 0.080105 0.008392 -0.093436 -0.275316 -0.285863 -0.281000 0.414934 -0.010607 0.070569 -0.231818 -0.264323 -0.059492 -0.044060 -0.090211 -0.072487 -0.133307 -0.132616 0.289479 0.330945 0.115790 0.093842 0.091963 0.099443 0.088987 0.116760 0.096335 0.091869 0.119094 0.138099 0.131073 0.078713 0.092818 0.107654 0.108788 0.101010 0.093079 0.103694 0.110163 0.094825 0.102306 0.078324 0.083561 0.078502 0.081624
qa: -0.2569 -0.5008 -0.4332 -0.4347 -0.0925 0.0801 0.0084 -0.0934 -0.2753 -0.2859 -0.2810 0.4149 -0.0106 0.0706 -0.2318 -0.2643 -0.0595 -0.0441 -0.0902 -0.0725 -0.1333 -0.1326 0.2895 0.3309 0.1158 0.0938 0.0920 0.0994 0.0890 0.1168 0.0963 0.0919 0.1191 0.1381 0.1311 0.0787 0.0928 0.1077 0.1088 0.1010 0.0931 0.1037 0.1102 0.0948 0.1023 0.0783 0.0836 0.0785 0.0816
va: 2.1039 1.9980 2.0626 2.0703 3.1407 3.7018 3.7773 3.8663 3.9142 3.8806 3.8465 4.0991 3.6522 3.8996 3.9301 3.9406 3.6562 3.6892 3.9136 3.9150 3.9051 3.9106 4.1566 4.1635 1.0041 1.0264 1.0031 1.0002 1.0055 1.0015 0.9990 1.0072 1.0180 1.0018 1.0068 1.0117 0.9954 0.9994 1.0004 0.9957 1.0041 1.0076 1.0062 1.0141 1.0059 1.0096 1.0101 1.0068 1.0096
dispcorr: -0.028397471 hartree
energy: -1094.893151071421
dipole: 3.20087 -4.84972 -1.64885 22.74380 -20.44080 2.30299 11.67257 -10.40314 1.26943
magnitude: 3.10386 au
magnitude: 7.88939 debye
