program: Orca
programVersion: 5.0.2
elementType: O O O O N C C C C C C C C C C C C C C C C C C C H H H H H H H H H H H H H H H H H H H H H H H H H
charge: 0
multiplicity: 1
keywords: wb97x-d3
keywords: def2-TZVPP
keywords: def2/J RIJCOSX
keywords: DEFGRID2
keywords: scfconv7
keywords: smallprint printgap noloewdin
keywords: NOSOSCF
formula: C19H25NO4
InChI: InChI=1/C19H25NO4/c1-11(2)9-14-15(19(14,3)4)18(23)24-10-20-16(21)12-7-5-6-8-13(12)17(20)22/h9,14-15H,5-8,10H2,1-4H3
49 atoms
O  1.007406 -1.912568 0.115483
O  1.989528 -0.662154 1.697997
O  -1.034971 0.373798 1.892866
O  -2.003968 -2.88785 -1.120497
N  -1.248026 -1.497137 0.555347
C  4.232753 -0.127813 -0.391685
C  3.14935 0.831366 -0.741079
C  2.824498 -0.660251 -0.551011
C  5.17498 -0.533662 -1.501639
C  4.909413 -0.068253 0.955737
C  2.657597 1.866073 0.198822
C  1.944398 -1.048836 0.55846
C  1.451819 2.433591 0.111233
C  -0.091629 -2.236765 0.949944
C  1.027975 3.522076 1.046594
C  0.451914 2.026987 -0.935013
C  -2.789823 0.185255 0.239034
C  -3.079962 -0.772287 -0.642335
C  -3.545189 1.450057 0.405664
C  -4.198106 -0.727725 -1.615561
C  -4.887059 1.345311 -0.321652
C  -4.747318 0.69805 -1.699428
C  -1.599299 -0.233934 1.020188
C  -2.09134 -1.867643 -0.487187
H  3.095277 1.116594 -1.789012
H  2.633409 -1.204094 -1.468595
H  4.675975 -0.561057 -2.471514
H  6.005911 0.17065 -1.577511
H  5.595161 -1.524338 -1.316733
H  4.26442 0.263498 1.764024
H  5.303577 -1.048894 1.229342
H  5.755556 0.620346 0.90609
H  3.337195 2.199807 0.976894
H  0.119739 -2.050289 2.000804
H  -0.288146 -3.297454 0.814256
H  0.746858 4.424753 0.497045
H  0.146222 3.222307 1.6197
H  1.814554 3.789621 1.752269
H  0.39669 0.944244 -1.061436
H  -0.548975 2.386551 -0.692798
H  0.708113 2.444689 -1.912958
H  -3.691236 1.669705 1.465931
H  -2.949804 2.278628 0.00696
H  -3.863882 -1.075272 -2.596051
H  -4.978685 -1.427404 -1.299523
H  -5.580456 0.757436 0.286503
H  -5.325814 2.339195 -0.420822
H  -4.079227 1.304102 -2.31793
H  -5.714392 0.686533 -2.204283
elementType: O N C H
totalener: -1094.87531790 hartree
nucrepener: 2190.38509747 hartree
electener: -3285.26041538 hartree
oneelecener: -5843.43673681 hartree
twoeener: 2558.17632144 hartree
cpcmener: -0.03466343 hartree
kineticenergy: 1090.03624055 hartree
xcener: -105.970611550326 hartree
chargesum: -0.0000000
charge: -0.285790 -0.441854 -0.401268 -0.409805 -0.073311 0.133250 -0.023886 -0.103900 -0.263401 -0.296576 -0.263753 0.378852 -0.017498 0.070522 -0.208527 -0.289872 -0.059559 -0.065577 -0.067902 -0.068701 -0.136677 -0.136277 0.263008 0.320169 0.112640 0.093802 0.086251 0.094542 0.096227 0.094313 0.099557 0.098843 0.122457 0.132453 0.130262 0.099697 0.086472 0.087021 0.089511 0.093650 0.122485 0.095797 0.101707 0.092331 0.099672 0.079303 0.080772 0.077792 0.080777
qa: -0.2858 -0.4419 -0.4013 -0.4098 -0.0733 0.1333 -0.0239 -0.1039 -0.2634 -0.2966 -0.2638 0.3789 -0.0175 0.0705 -0.2085 -0.2899 -0.0596 -0.0656 -0.0679 -0.0687 -0.1367 -0.1363 0.2630 0.3202 0.1126 0.0938 0.0863 0.0945 0.0962 0.0943 0.0996 0.0988 0.1225 0.1325 0.1303 0.0997 0.0865 0.0870 0.0895 0.0936 0.1225 0.0958 0.1017 0.0923 0.0997 0.0793 0.0808 0.0778 0.0808
va: 2.0990 2.0515 2.0990 2.1069 3.0876 3.7646 3.8127 3.8289 3.8965 3.8925 3.8219 4.1220 3.6937 3.9048 3.9074 3.9598 3.6195 3.6752 3.9115 3.9228 3.9186 3.9145 4.1958 4.2125 1.0031 1.0329 1.0044 1.0024 1.0026 1.0174 1.0006 0.9983 1.0013 1.0192 1.0068 0.9946 1.0028 1.0092 0.9997 1.0074 0.9990 1.0164 1.0064 1.0159 1.0042 1.0066 1.0097 1.0072 1.0094
dispcorr: -0.027082096 hartree
energy: -1094.902399999344
dipole: 7.17060 -8.49720 -1.32660 17.97072 -17.16242 0.80830 -7.31573 5.85906 -1.45667
magnitude: 2.12958 au
magnitude: 5.41295 debye
