program: Orca
programVersion: 5.0.2
elementType: O O O O N C C C C C C C C C C C C C C C C C C C H H H H H H H H H H H H H H H H H H H H H H H H H
charge: 0
multiplicity: 1
keywords: wb97x-d3
keywords: def2-TZVPP
keywords: def2/J RIJCOSX
keywords: DEFGRID2
keywords: scfconv7
keywords: smallprint printgap noloewdin
keywords: NOSOSCF
formula: C19H25NO4
InChI: InChI=1/C19H25NO4/c1-11(2)9-14-15(19(14,3)4)18(23)24-10-20-16(21)12-7-5-6-8-13(12)17(20)22/h9,14-15H,5-8,10H2,1-4H3
49 atoms
O  1.169909 -0.820824 -0.719805
O  2.655983 -1.671257 -2.136893
O  -1.027241 -2.564209 1.03191
O  -1.704522 0.649395 -2.104849
N  -1.091467 -1.12187 -0.763239
C  3.486047 -0.210791 1.151282
C  3.299979 1.01824 0.329759
C  3.454237 -0.332939 -0.365114
C  4.845644 -0.441567 1.76885
C  2.36166 -0.731823 2.013545
C  2.041035 1.807828 0.350363
C  2.409386 -1.004246 -1.156247
C  1.511872 2.456333 -0.689405
C  0.11878 -1.500546 -1.401401
C  0.277776 3.293274 -0.540021
C  2.078753 2.400786 -2.073557
C  -2.727594 -0.849732 0.833728
C  -2.918013 0.102253 -0.081586
C  -3.564456 -1.052038 2.041394
C  -4.007329 1.108293 -0.051531
C  -4.433953 0.185363 2.270119
C  -5.064114 0.685324 0.970926
C  -1.538155 -1.64634 0.444516
C  -1.869834 -0.028115 -1.123268
H  4.195748 1.623622 0.209725
H  4.424897 -0.491304 -0.820535
H  5.651999 -0.076348 1.131266
H  4.923109 0.074818 2.72812
H  5.019294 -1.504178 1.949606
H  2.484609 -0.349677 3.029166
H  1.370788 -0.438303 1.680182
H  2.387001 -1.821376 2.072561
H  1.548256 1.898183 1.314732
H  0.251278 -2.580445 -1.333197
H  0.076632 -1.212907 -2.451366
H  0.487627 4.343365 -0.765156
H  -0.499876 2.980262 -1.241173
H  -0.135935 3.24334 0.467355
H  1.355697 1.957487 -2.76423
H  2.284303 3.406244 -2.449275
H  3.0015 1.827552 -2.140716
H  -4.186137 -1.943033 1.903246
H  -2.935832 -1.256709 2.911692
H  -3.585711 2.085515 0.206009
H  -4.448122 1.223985 -1.044451
H  -5.211616 -0.04479 2.999769
H  -3.821529 0.980201 2.705754
H  -5.730592 1.524476 1.17589
H  -5.683248 -0.1073 0.540695
elementType: O N C H
totalener: -1094.87490458 hartree
nucrepener: 2200.58482029 hartree
electener: -3295.45972487 hartree
oneelecener: -5863.11537570 hartree
twoeener: 2567.65565083 hartree
cpcmener: -0.03043318 hartree
kineticenergy: 1090.04874809 hartree
xcener: -105.972597009693 hartree
chargesum: 0.0000000
charge: -0.251087 -0.471791 -0.408091 -0.412255 -0.087745 0.148581 -0.017247 -0.142790 -0.269503 -0.292470 -0.252644 0.406504 -0.033969 0.065995 -0.236928 -0.257405 -0.046887 -0.045284 -0.073692 -0.070086 -0.134830 -0.135929 0.289473 0.284896 0.113246 0.095563 0.086396 0.093049 0.095668 0.099024 0.081287 0.105488 0.120297 0.138522 0.131946 0.106385 0.086193 0.090165 0.094850 0.106981 0.093128 0.100765 0.093492 0.100135 0.094611 0.080163 0.078399 0.081057 0.078372
qa: -0.2511 -0.4718 -0.4081 -0.4123 -0.0877 0.1486 -0.0172 -0.1428 -0.2695 -0.2925 -0.2526 0.4065 -0.0340 0.0660 -0.2369 -0.2574 -0.0469 -0.0453 -0.0737 -0.0701 -0.1348 -0.1359 0.2895 0.2849 0.1132 0.0956 0.0864 0.0930 0.0957 0.0990 0.0813 0.1055 0.1203 0.1385 0.1319 0.1064 0.0862 0.0902 0.0949 0.1070 0.0931 0.1008 0.0935 0.1001 0.0946 0.0802 0.0784 0.0811 0.0784
va: 2.1019 2.0329 2.1011 2.0913 3.1310 3.6919 3.8078 3.8640 3.9090 3.9184 3.8401 4.1066 3.6993 3.8989 3.9190 3.9402 3.6832 3.6766 3.9172 3.9158 3.9143 3.9172 4.1919 4.1854 1.0055 1.0279 1.0057 1.0019 1.0014 1.0005 1.0035 1.0018 1.0004 1.0007 1.0058 0.9976 1.0061 1.0063 1.0034 0.9999 1.0062 1.0044 1.0158 1.0057 1.0161 1.0097 1.0068 1.0095 1.0066
dispcorr: -0.027176181 hartree
energy: -1094.902080757358
dipole: 2.85013 -4.51627 -1.66613 14.86085 -13.63038 1.23047 11.57167 -9.89448 1.67719
magnitude: 2.66515 au
magnitude: 6.77427 debye
