program: Orca
programVersion: 5.0.2
elementType: O O O O N C C C C C C C C C C C C C C C C C C C H H H H H H H H H H H H H H H H H H H H H H H H H
charge: 0
multiplicity: 1
keywords: wb97x-d3
keywords: def2-TZVPP
keywords: def2/J RIJCOSX
keywords: DEFGRID2
keywords: scfconv7
keywords: smallprint printgap noloewdin
keywords: NOSOSCF
formula: C19H25NO4
InChI: InChI=1/C19H25NO4/c1-11(2)9-14-15(19(14,3)4)18(23)24-10-20-16(21)12-7-5-6-8-13(12)17(20)22/h9,14-15H,5-8,10H2,1-4H3
49 atoms
O  1.19965 -1.864411 -1.11542
O  1.244918 -1.242991 1.030151
O  -1.166755 -0.629428 -2.673602
O  -1.611217 -2.259443 1.548736
N  -1.105154 -1.712127 -0.641215
C  4.017652 -0.004492 0.429204
C  3.041537 1.033462 0.000855
C  2.891924 -0.412815 -0.501172
C  5.379966 0.020498 -0.224547
C  4.071177 -0.4791 1.860529
C  2.050484 1.64879 0.913195
C  1.725081 -1.194312 -0.074971
C  0.964096 2.295304 0.481323
C  -0.004462 -2.58507 -0.904667
C  0.00967 2.949557 1.429745
C  0.633855 2.394704 -0.981937
C  -2.533125 0.089087 -0.806549
C  -2.6617 -0.395498 0.429234
C  -3.259517 1.26614 -1.341765
C  -3.578349 0.137848 1.465299
C  -3.910245 2.030331 -0.187061
C  -4.581392 1.092043 0.815303
C  -1.544282 -0.743391 -1.53486
C  -1.752244 -1.558697 0.581901
H  3.382598 1.690835 -0.795646
H  3.174722 -0.571035 -1.535064
H  5.333228 0.378417 -1.254178
H  6.056563 0.678656 0.324142
H  5.824488 -0.976485 -0.238505
H  3.11644 -0.453542 2.376308
H  4.445832 -1.503257 1.909976
H  4.764593 0.149291 2.423245
H  2.238461 1.592929 1.980489
H  0.082732 -3.297661 -0.08446
H  -0.168241 -3.133881 -1.829606
H  0.316966 2.835954 2.469409
H  -0.083581 4.018675 1.218719
H  -0.995142 2.528769 1.327185
H  -0.283584 2.958801 -1.151018
H  1.427359 2.891881 -1.545416
H  0.503713 1.410131 -1.43632
H  -2.576502 1.911013 -1.90029
H  -4.013783 0.932631 -2.061736
H  -4.09151 -0.68092 1.975578
H  -2.993249 0.651485 2.235354
H  -3.146718 2.621536 0.327536
H  -4.638959 2.739223 -0.582799
H  -5.352343 0.508048 0.30401
H  -5.089483 1.670821 1.588078
elementType: O N C H
totalener: -1094.87435650 hartree
nucrepener: 2237.37326375 hartree
electener: -3332.24762025 hartree
oneelecener: -5937.37693095 hartree
twoeener: 2605.12931070 hartree
cpcmener: -0.03368294 hartree
kineticenergy: 1090.04601433 hartree
xcener: -105.973595506664 hartree
chargesum: -0.0000000
charge: -0.286946 -0.454449 -0.407924 -0.400109 -0.092971 0.131713 -0.035731 -0.100597 -0.262179 -0.294452 -0.243043 0.390203 -0.013027 0.089304 -0.210079 -0.302259 -0.075856 -0.051558 -0.081539 -0.083210 -0.154377 -0.123996 0.278149 0.311559 0.113142 0.091928 0.085814 0.094414 0.096057 0.094004 0.100129 0.098545 0.123020 0.130349 0.140276 0.091321 0.102334 0.069338 0.099941 0.116095 0.093233 0.095024 0.108655 0.097719 0.102440 0.085360 0.085400 0.077873 0.080963
qa: -0.2869 -0.4544 -0.4079 -0.4001 -0.0930 0.1317 -0.0357 -0.1006 -0.2622 -0.2945 -0.2430 0.3902 -0.0130 0.0893 -0.2101 -0.3023 -0.0759 -0.0516 -0.0815 -0.0832 -0.1544 -0.1240 0.2781 0.3116 0.1131 0.0919 0.0858 0.0944 0.0961 0.0940 0.1001 0.0985 0.1230 0.1303 0.1403 0.0913 0.1023 0.0693 0.0999 0.1161 0.0932 0.0950 0.1087 0.0977 0.1024 0.0854 0.0854 0.0779 0.0810
va: 2.1082 2.0368 2.1000 2.1160 3.0665 3.7745 3.8128 3.8330 3.8963 3.8921 3.7955 4.1095 3.6575 3.9032 3.9191 3.9604 3.6336 3.6043 3.9025 3.9158 3.9157 3.9029 4.1969 4.2156 1.0042 1.0318 1.0049 1.0024 1.0026 1.0189 1.0003 0.9989 1.0023 1.0159 0.9936 1.0121 0.9948 0.9950 1.0026 1.0026 1.0023 1.0127 1.0060 1.0162 1.0038 1.0047 1.0124 1.0070 1.0104
dispcorr: -0.028592183 hartree
energy: -1094.902948683592
dipole: 6.91750 -7.50345 -0.58595 20.62529 -19.25111 1.37419 5.65268 -6.16724 -0.51456
magnitude: 1.58003 au
magnitude: 4.01611 debye
