program: Gaussian 09
title: 000067980
version: EM64L-G09RevD.01
frameworkgroup: C1[X(C7H6F2)]
method: RPBEPBE
basis: SDD
operation: Freq
keyword: #p
keyword: freq=noraman
keyword: PBEPBE/SDD
title: #p freq=noraman PBEPBE/SDD
converged: NO YES NO NO
title: Mulliken charges:
elementType: F F C C C C C C C H H H H H H
charge: -0.201441 -0.207040 0.336777 0.187244 -0.520871 -0.771516 0.343839 -0.317595 -0.353435 0.265686 0.246438 0.246531 0.223669 0.259427 0.262288
chargesum: 0.00000
title: Mulliken charges with hydrogens summed into heavy atoms:
elementType: F F C C C C C C C
charge: -0.201441 -0.207040 0.336777 0.187244 -0.255185 -0.054878 0.343839 -0.058168 -0.091147
polarizability: 9.28219964e+01 4.46457359e+00 8.39807090e+01 2.90419830e-02 1.53711769e-02 3.56626069e+01
1716.lowfreq: 0.0008 0.0008 0.0014 3.1969 11.9248 12.6089 67.1287 144.0227 201.1855
frequency: 67.0057 144.0194 201.1785 255.4774 312.9744 358.7509 426.1379 441.8254 472.6492 550.6812 561.6620 691.7376 704.2056 737.9741 806.6801 869.5134 923.9898 930.1691 997.2590 1045.2857 1094.3835 1137.9087 1163.2865 1239.0628 1267.4356 1381.1920 1401.9739 1409.2268 1459.7641 1468.4048 1487.8701 1598.6976 1626.1887 2988.7153 3067.8319 3101.1332 3165.1676 3169.6581 3189.3779
redmass: 1.0308 8.6283 3.3607 3.4143 10.7602 7.3849 8.8191 2.9367 4.9547 5.2748 3.2298 7.0961 3.5965 5.3513 1.3911 1.4139 1.3336 4.0382 1.5410 1.5113 1.7433 1.6800 2.5217 1.9096 2.3836 7.0829 1.2654 3.3439 1.0445 1.6525 1.7802 6.4927 8.3869 1.0370 1.0973 1.1000 1.0927 1.0892 1.0981
irintensity: 0.5329 3.3101 1.8667 1.5599 5.8554 0.5569 0.1540 7.1214 1.7439 0.1343 4.0690 31.2445 0.9456 11.0367 47.1214 38.1976 0.0088 12.6467 13.6692 8.6440 15.3115 31.9720 78.3410 0.5106 3.1764 1.3322 14.4640 17.1739 13.9665 13.9102 153.8501 5.8043 9.0220 17.4058 13.3730 15.2786 2.0896 1.6042 0.6988
temp: 298.150 k
press: 1.00000 atm
elementType: 9 9 6 6 6 6 6 6 6 1 1 1 1 1 1
symmnumber: 1
zpe: 286604.0 jmol-1
zpe.correction: 0.109162 hartree
zpe.thermalcorrener: 0.117180 hartree
zpe.thermalcorrenthalpy: 0.118125 hartree
zpe.thermalcorrgfe: 0.076196 hartree
zpe.sumelectzpe: -469.379875 hartree
zpe.sumelectthermal: -469.371856 hartree
zpe.sumelectthermalent: -469.370912 hartree
zpe.sumelectthermalfe: -469.412841 hartree
dipole: 0.6106 0.3682 0.0054
dipole: 0.7130
quadrupole: -58.5201 -43.7189 -52.9896
quadrupole: 5.9734 0.0087 0.0029
quadrupole: -6.7772 8.0240 -1.2467 5.9734 0.0087 0.0029
hfenergy: -469.4890369 hartree
pointgroup: C01 [X(C7H6F2)]
dipole: -0.2342122 -0.1543779 0.002061 debye
dipolederiv: -0.9623713 0.2108693 -0.0003598 0.2149198 -0.2801057 0.0001341 -0.0002514 -0.0000279 -0.1435167 -1.0493769 0.1773305 -0.0001154 0.2178922 -0.2607668 -0.000046 0.0000063 -0.0002273 -0.1506029 0.1280293 0.1206446 -0.0009069 0.3054203 0.1502418 -0.0007764 -0.0033896 -0.0038316 -0.0303927 0.9764859 -0.2676917 0.0000062 -0.3574815 0.1346829 -0.0000551 0.000164 0.0003099 0.0456827 -0.2291281 -0.0147681 0.0002478 -0.1294728 -0.0306843 -0.00021 0.000646 0.0004944 -0.1717981 -0.1068511 -0.1383502 0.000206 -0.0790797 0.0398591 0.0013112 0.0042959 0.0062103 0.0626386 1.1493927 -0.198383 -0.0001028 -0.2599629 0.2821072 0.0002255 0.0001509 0.0004023 0.0946758 -0.0484806 0.1034571 0.0000122 -0.087689 0.0238906 -0.0003694 -0.0000237 0.0002421 -0.1403056 -0.1419411 -0.0457134 0.0003397 0.1738375 -0.0651019 0.000289 0.0001136 0.0000355 -0.1739996 0.0911771 0.0190465 -0.0002433 0.0409776 -0.0311049 -0.0002317 -0.0001199 -0.0005866 0.1776418 0.0249217 -0.0348242 0.0932367 -0.0228289 0.0598636 -0.0389725 0.1131388 0.0108261 -0.029692 0.0195076 -0.030522 -0.0955897 -0.0154454 0.0598326 0.043685 -0.1152108 -0.0078582 -0.0197166 0.0398657 0.1231867 0.003443 0.0267899 -0.1015143 -0.0048003 0.00065 -0.0057762 0.1118551 0.0828904 0.0395357 -0.000083 0.0407521 -0.0228016 -0.0000702 -0.0000734 -0.0000946 0.1797419 0.0258787 -0.0638177 -0.0000906 -0.0686291 0.0416017 -0.0001133 -0.0000966 -0.000118 0.1877884 unknown
polarizability: 92.450265|4.8042607|84.3524506|-0.0205652|-0.0078493|35.6625967 unknown
InChI: InChI=1S/C7H6F2/c1-5-4-6(8)2-3-7(5)9/h2-4H,1H3
charge 0 multiplicity 1
15 atoms
F  -2.449355 0.934172 -0.001158
F  2.940139 -0.4617 -0.00016
C  -0.761945 -0.80259 -0.001189
C  -1.081956 0.575947 -0.000654
C  0.61643 -1.129719 -0.001241
C  -1.848284 -1.857277 -0.000173
C  1.576651 -0.101804 -0.000154
C  -0.127825 1.605827 0.000288
C  1.243298 1.262973 0.000651
H  0.940768 -2.174812 -0.002217
H  -2.484175 -1.772717 0.900091
H  -2.517896 -1.740467 -0.871554
H  -1.415315 -2.870686 -0.026032
H  -0.453211 2.649789 0.000595
H  2.026578 2.025262 0.001306
