program: Orca
programVersion: 5.0.2
elementType: O O O O N C C C C C C C C C C C C C C C C C C C H H H H H H H H H H H H H H H H H H H H H H H H H
charge: 0
multiplicity: 1
keywords: wb97x-d3
keywords: def2-TZVPP
keywords: def2/J RIJCOSX
keywords: DEFGRID2
keywords: scfconv7
keywords: smallprint printgap noloewdin
keywords: NOSOSCF
formula: C19H25NO4
InChI: InChI=1/C19H25NO4/c1-11(2)9-14-15(19(14,3)4)18(23)24-10-20-16(21)12-7-5-6-8-13(12)17(20)22/h9,14-15H,5-8,10H2,1-4H3
49 atoms
O  0.392315 -0.537804 -0.052439
O  2.160013 -1.106892 1.176701
O  -1.796374 -2.715395 -1.541272
O  -2.401129 0.392356 1.717328
N  -1.75703 -1.267374 0.252529
C  3.801843 0.418963 -1.008887
C  3.448279 1.492443 -0.028009
C  2.359543 0.553943 -0.55869
C  4.059543 0.854853 -2.432074
C  4.653001 -0.75601 -0.594995
C  3.899048 1.487481 1.376021
C  1.681114 -0.440908 0.289087
C  4.374116 2.543071 2.0482
C  -0.417236 -1.452659 0.684507
C  4.803182 2.402187 3.478726
C  4.53127 3.927923 1.496641
C  -3.683762 -1.294835 -1.008568
C  -3.858782 -0.376615 -0.056728
C  -4.68965 -1.664222 -2.033992
C  -5.080552 0.445634 0.121754
C  -6.054091 -1.095123 -1.640017
C  -5.950434 0.342706 -1.132712
C  -2.326921 -1.877125 -0.859851
C  -2.630348 -0.317655 0.773138
H  3.35658 2.478807 -0.468403
H  1.698501 1.011586 -1.285271
H  3.856144 0.042848 -3.133467
H  3.438175 1.704537 -2.718633
H  5.103136 1.15022 -2.559875
H  5.704797 -0.510893 -0.755963
H  4.544515 -1.044859 0.446141
H  4.425151 -1.63084 -1.207141
H  3.847582 0.545958 1.909144
H  -0.352835 -1.257658 1.754642
H  -0.109655 -2.48046 0.491578
H  5.862521 2.645952 3.597588
H  4.254862 3.094846 4.123307
H  4.645639 1.39341 3.860455
H  5.557978 4.277118 1.633441
H  4.295893 4.018239 0.438232
H  3.894582 4.632607 2.038495
H  -4.372192 -1.275388 -3.007076
H  -4.736949 -2.750109 -2.146092
H  -5.627018 0.0954 1.003486
H  -4.812978 1.484725 0.328104
H  -6.729942 -1.142559 -2.49507
H  -6.493292 -1.723036 -0.85946
H  -6.945118 0.73718 -0.920442
H  -5.52494 0.974251 -1.917844
elementType: O N C H
totalener: -1094.87855451 hartree
nucrepener: 2039.11065123 hartree
electener: -3133.98920574 hartree
oneelecener: -5540.48911469 hartree
twoeener: 2406.49990895 hartree
cpcmener: -0.03018076 hartree
kineticenergy: 1090.02770915 hartree
xcener: -105.968852868492 hartree
chargesum: -0.0000000
charge: -0.279076 -0.470657 -0.407789 -0.407321 -0.116672 0.106868 0.030166 -0.091641 -0.260279 -0.282279 -0.287438 0.402086 -0.053228 0.092660 -0.219062 -0.255825 -0.071911 -0.072506 -0.073021 -0.071052 -0.134670 -0.136638 0.319460 0.318057 0.115222 0.096108 0.093569 0.086534 0.094023 0.096565 0.096436 0.101407 0.121606 0.126346 0.133482 0.092637 0.091603 0.088902 0.094123 0.087948 0.098062 0.100861 0.093765 0.100684 0.093164 0.080787 0.078156 0.081201 0.078573
qa: -0.2791 -0.4707 -0.4078 -0.4073 -0.1167 0.1069 0.0302 -0.0916 -0.2603 -0.2823 -0.2874 0.4021 -0.0532 0.0927 -0.2191 -0.2558 -0.0719 -0.0725 -0.0730 -0.0711 -0.1347 -0.1366 0.3195 0.3181 0.1152 0.0961 0.0936 0.0865 0.0940 0.0966 0.0964 0.1014 0.1216 0.1263 0.1335 0.0926 0.0916 0.0889 0.0941 0.0879 0.0981 0.1009 0.0938 0.1007 0.0932 0.0808 0.0782 0.0812 0.0786
va: 2.1144 2.0242 2.1100 2.1103 3.1306 3.7084 3.7375 3.8873 3.9123 3.9052 3.8525 4.0798 3.7867 3.8913 3.9226 3.9395 3.6710 3.6665 3.9225 3.9204 3.9134 3.9163 4.2180 4.2157 1.0049 1.0271 1.0023 1.0053 1.0020 1.0009 1.0139 0.9995 1.0234 1.0050 1.0006 0.9966 0.9962 1.0089 0.9974 1.0133 0.9963 1.0052 1.0150 1.0046 1.0156 1.0096 1.0067 1.0095 1.0068
dispcorr: -0.021648937 hartree
energy: -1094.900203444697
dipole: 17.36875 -18.88958 -1.52083 15.54701 -14.53791 1.00910 -2.38410 1.17884 -1.20526
magnitude: 2.18720 au
magnitude: 5.55943 debye
