program: Orca
programVersion: 5.0.2
elementType: O O O O N C C C C C C C C C C C C C C C C C C C H H H H H H H H H H H H H H H H H H H H H H H H H
charge: 0
multiplicity: 1
keywords: wb97x-d3
keywords: def2-TZVPP
keywords: def2/J RIJCOSX
keywords: DEFGRID2
keywords: scfconv7
keywords: smallprint printgap noloewdin
keywords: NOSOSCF
formula: C19H25NO4
InChI: InChI=1/C19H25NO4/c1-11(2)9-14-15(19(14,3)4)18(23)24-10-20-16(21)12-7-5-6-8-13(12)17(20)22/h9,14-15H,5-8,10H2,1-4H3
49 atoms
O  1.341423 -1.46154 -0.117474
O  2.066422 -1.607935 -2.230306
O  -1.04342 -0.56478 -2.379817
O  -1.444703 -1.764291 1.982836
N  -0.987046 -1.469659 -0.259031
C  3.962216 -0.138893 0.599593
C  3.04454 0.965629 0.202902
C  3.251667 -0.226569 -0.740196
C  5.445484 0.132463 0.489337
C  3.634451 -1.064355 1.746491
C  1.763765 1.249277 0.894038
C  2.178298 -1.159884 -1.113867
C  0.812424 2.063328 0.427587
C  0.194099 -2.260075 -0.369192
C  -0.412093 2.373011 1.233824
C  0.866564 2.713106 -0.920772
C  -2.651201 0.0657 -0.683977
C  -2.765404 -0.28182 0.598238
C  -3.527151 1.034891 -1.385259
C  -3.773562 0.256768 1.543208
C  -4.777087 1.292691 -0.542885
C  -4.438018 1.492926 0.933489
C  -1.490953 -0.652749 -1.265581
C  -1.690022 -1.252006 0.92121
H  3.543491 1.852293 -0.178789
H  3.880631 -0.015473 -1.597161
H  5.818466 0.598798 1.403601
H  6.003604 -0.793697 0.337155
H  5.678745 0.800439 -0.340957
H  2.573251 -1.193784 1.937287
H  4.063069 -2.053538 1.574591
H  4.081689 -0.67195 2.662222
H  1.613887 0.796313 1.869281
H  0.168974 -3.035999 0.392575
H  0.234157 -2.729119 -1.349617
H  -0.418139 3.42306 1.54083
H  -1.32099 2.222694 0.646988
H  -0.481574 1.762196 2.134199
H  0.596546 3.770312 -0.861615
H  1.842559 2.642086 -1.39848
H  0.141426 2.246542 -1.594441
H  -2.972794 1.965178 -1.549929
H  -3.79197 0.664048 -2.378271
H  -4.516678 -0.517155 1.760943
H  -3.304334 0.498709 2.500234
H  -5.302818 2.16774 -0.927727
H  -5.461846 0.445988 -0.646012
H  -5.3406 1.737102 1.495613
H  -3.765406 2.349772 1.036846
elementType: O N C H
totalener: -1094.87292264 hartree
nucrepener: 2235.29485829 hartree
electener: -3330.16778093 hartree
oneelecener: -5932.59032025 hartree
twoeener: 2602.42253932 hartree
cpcmener: -0.03432617 hartree
kineticenergy: 1090.04553938 hartree
xcener: -105.975295257270 hartree
chargesum: -0.0000000
charge: -0.261932 -0.459547 -0.404389 -0.411074 -0.075423 0.148002 -0.044246 -0.138408 -0.264926 -0.285774 -0.237821 0.418234 -0.029821 0.057910 -0.222208 -0.266335 -0.048219 -0.094621 -0.064038 -0.081319 -0.128661 -0.148515 0.282124 0.320149 0.109646 0.091188 0.093596 0.095419 0.086346 0.086071 0.103433 0.096883 0.122389 0.124778 0.140294 0.114978 0.062240 0.093346 0.103513 0.093773 0.090895 0.100309 0.099294 0.107362 0.097783 0.081301 0.078182 0.085285 0.082555
qa: -0.2619 -0.4595 -0.4044 -0.4111 -0.0754 0.1480 -0.0442 -0.1384 -0.2649 -0.2858 -0.2378 0.4182 -0.0298 0.0579 -0.2222 -0.2663 -0.0482 -0.0946 -0.0640 -0.0813 -0.1287 -0.1485 0.2821 0.3201 0.1096 0.0912 0.0936 0.0954 0.0863 0.0861 0.1034 0.0969 0.1224 0.1248 0.1403 0.1150 0.0622 0.0933 0.1035 0.0938 0.0909 0.1003 0.0993 0.1074 0.0978 0.0813 0.0782 0.0853 0.0826
va: 2.1004 2.0526 2.1030 2.1013 3.0962 3.7443 3.7957 3.8615 3.9004 3.8988 3.8200 4.1422 3.6951 3.8802 3.9327 3.9434 3.5956 3.6573 3.9073 3.9080 3.9116 3.9107 4.2018 4.1842 1.0032 1.0294 1.0021 1.0022 1.0054 1.0162 1.0005 0.9993 1.0040 1.0130 1.0210 0.9981 0.9966 1.0082 0.9988 1.0077 1.0051 1.0062 1.0162 1.0051 1.0141 1.0103 1.0074 1.0116 1.0051
dispcorr: -0.029203410 hartree
energy: -1094.902126046590
dipole: 3.35029 -4.65076 -1.30047 18.28154 -16.81920 1.46233 8.48269 -7.22659 1.25610
magnitude: 2.32538 au
magnitude: 5.91066 debye
