program: Orca
programVersion: 5.0.2
elementType: O O O O N C C C C C C C C C C C C C C C C C C C H H H H H H H H H H H H H H H H H H H H H H H H H
charge: 0
multiplicity: 1
keywords: wb97x-d3
keywords: def2-TZVPP
keywords: def2/J RIJCOSX
keywords: DEFGRID2
keywords: scfconv7
keywords: smallprint printgap noloewdin
keywords: NOSOSCF
formula: C19H25NO4
InChI: InChI=1/C19H25NO4/c1-11(2)9-14-15(19(14,3)4)18(23)24-10-20-16(21)12-7-5-6-8-13(12)17(20)22/h9,14-15H,5-8,10H2,1-4H3
49 atoms
O  0.214068 -0.042576 0.328388
O  1.677881 0.691166 1.836035
O  -2.779676 1.567552 -0.255399
O  -1.8627 -2.628975 1.223789
N  -2.02493 -0.389378 0.701529
C  3.787701 -0.505514 -0.158097
C  3.670832 0.932156 -0.558984
C  2.407923 0.08901 -0.380405
C  4.235214 -1.483288 -1.218426
C  4.26991 -0.874134 1.222131
C  4.034001 2.052858 0.33038
C  1.448158 0.292778 0.718107
C  4.820749 3.071217 -0.032863
C  -0.825698 0.079887 1.298729
C  5.133457 4.180505 0.924677
C  5.433492 3.201853 -1.402193
C  -3.961732 -0.527444 -0.536427
C  -3.695054 -1.758534 -0.097524
C  -5.130436 -0.15422 -1.370407
C  -4.532591 -2.956132 -0.352358
C  -5.778525 -1.420251 -1.93345
C  -5.900966 -2.515741 -0.874678
C  -2.89688 0.386938 -0.054434
C  -2.436886 -1.717566 0.687323
H  3.873083 1.117468 -1.608887
H  1.933181 -0.206311 -1.308746
H  5.325532 -1.534086 -1.256113
H  3.863348 -2.488214 -1.007692
H  3.882496 -1.199934 -2.211082
H  5.359086 -0.948442 1.214931
H  4.0005 -0.160286 1.994905
H  3.878152 -1.848848 1.518871
H  3.645429 2.047742 1.340607
H  -0.952796 1.120035 1.599038
H  -0.603805 -0.519059 2.181843
H  4.639214 4.047197 1.887245
H  6.209438 4.254153 1.105037
H  4.824257 5.147819 0.518339
H  6.208421 3.96867 -1.412501
H  5.89261 2.274709 -1.747058
H  4.692837 3.492705 -2.15135
H  -5.844287 0.407545 -0.759046
H  -4.825758 0.521304 -2.173322
H  -4.028711 -3.601034 -1.079822
H  -4.633273 -3.551784 0.558079
H  -6.761927 -1.178055 -2.338997
H  -5.177538 -1.790547 -2.769165
H  -6.431452 -3.377017 -1.283273
H  -6.502053 -2.145522 -0.039033
elementType: O N C H
totalener: -1094.87747808 hartree
nucrepener: 2034.34311716 hartree
electener: -3129.22059524 hartree
oneelecener: -5530.94918541 hartree
twoeener: 2401.72859017 hartree
cpcmener: -0.02974603 hartree
kineticenergy: 1090.03183292 hartree
xcener: -105.969081684312 hartree
chargesum: -0.0000000
charge: -0.279664 -0.471289 -0.407094 -0.407621 -0.113096 0.115000 0.046631 -0.110638 -0.262488 -0.283230 -0.328872 0.407272 -0.004042 0.089194 -0.221770 -0.293560 -0.074019 -0.072562 -0.072446 -0.071582 -0.135548 -0.136110 0.319344 0.319445 0.114111 0.096366 0.093753 0.094302 0.086726 0.097458 0.095931 0.101763 0.123643 0.131946 0.128444 0.084917 0.093365 0.097190 0.095183 0.101200 0.105568 0.100370 0.093792 0.101334 0.093160 0.080934 0.078027 0.081303 0.077958
qa: -0.2797 -0.4713 -0.4071 -0.4076 -0.1131 0.1150 0.0466 -0.1106 -0.2625 -0.2832 -0.3289 0.4073 -0.0040 0.0892 -0.2218 -0.2936 -0.0740 -0.0726 -0.0724 -0.0716 -0.1355 -0.1361 0.3193 0.3194 0.1141 0.0964 0.0938 0.0943 0.0867 0.0975 0.0959 0.1018 0.1236 0.1319 0.1284 0.0849 0.0934 0.0972 0.0952 0.1012 0.1056 0.1004 0.0938 0.1013 0.0932 0.0809 0.0780 0.0813 0.0780
va: 2.1155 2.0221 2.1109 2.1107 3.1257 3.7101 3.7250 3.9330 3.9133 3.9094 3.8903 4.0725 3.7016 3.8920 3.9263 3.9475 3.6738 3.6670 3.9213 3.9213 3.9155 3.9138 4.2164 4.2166 1.0004 1.0269 1.0019 1.0024 1.0051 1.0011 1.0142 0.9999 1.0236 1.0020 1.0033 1.0103 0.9940 0.9927 1.0039 0.9961 0.9943 1.0046 1.0154 1.0052 1.0154 1.0095 1.0070 1.0095 1.0070
dispcorr: -0.021740695 hartree
energy: -1094.899218774644
dipole: 21.07381 -22.21752 -1.14370 3.86517 -4.64789 -0.78272 -8.97122 7.35131 -1.61990
magnitude: 2.13185 au
magnitude: 5.41874 debye
