program: Orca
programVersion: 5.0.2
elementType: O O O O N C C C C C C C C C C C C C C C C C C C H H H H H H H H H H H H H H H H H H H H H H H H H
charge: 0
multiplicity: 1
keywords: wb97x-d3
keywords: def2-TZVPP
keywords: def2/J RIJCOSX
keywords: DEFGRID2
keywords: scfconv7
keywords: smallprint printgap noloewdin
keywords: NOSOSCF
formula: C19H25NO4
InChI: InChI=1/C19H25NO4/c1-11(2)9-14-15(19(14,3)4)18(23)24-10-20-16(21)12-7-5-6-8-13(12)17(20)22/h9,14-15H,5-8,10H2,1-4H3
49 atoms
O  0.301422 -0.313876 0.061531
O  2.157603 -1.105783 1.000646
O  -1.646364 -2.487195 -1.681298
O  -2.617397 0.217846 1.835545
N  -1.789806 -1.232238 0.245822
C  3.597316 0.66424 -1.147085
C  3.479333 1.56606 0.041432
C  2.24981 0.806852 -0.463058
C  3.690735 1.324289 -2.502497
C  4.387685 -0.617389 -1.062242
C  4.11623 1.293277 1.344672
C  1.619643 -0.295837 0.282539
C  4.795536 2.194111 2.063137
C  -0.448988 -1.348815 0.696063
C  5.37289 1.833939 3.398694
C  5.01389 3.621192 1.64509
C  -3.676447 -1.31475 -1.072042
C  -3.963823 -0.527387 -0.034267
C  -4.61113 -1.64999 -2.1739
C  -5.274201 0.125314 0.205462
C  -5.811207 -0.701945 -2.129441
C  -6.329972 -0.50361 -0.705723
C  -2.273916 -1.779304 -0.937501
C  -2.760072 -0.423575 0.827423
H  3.413221 2.619417 -0.208285
H  1.53421 1.42238 -0.995577
H  3.318674 0.662431 -3.28752
H  3.114701 2.24961 -2.547696
H  4.728489 1.56897 -2.738749
H  5.422113 -0.421012 -1.351634
H  4.409187 -1.063499 -0.072262
H  3.991402 -1.362263 -1.755232
H  4.023797 0.294036 1.75122
H  -0.418767 -1.239544 1.78008
H  -0.060867 -2.331008 0.427099
H  6.460351 1.948287 3.402838
H  4.992721 2.499433 4.17926
H  5.140294 0.809533 3.689932
H  4.212236 4.268004 2.013022
H  5.94304 4.008989 2.066278
H  5.069395 3.751416 0.564815
H  -4.100102 -1.589564 -3.137824
H  -4.933974 -2.69096 -2.069292
H  -5.558827 0.032716 1.256329
H  -5.183729 1.199139 0.011984
H  -5.520136 0.266311 -2.546794
H  -6.606499 -1.089807 -2.767562
H  -6.63034 -1.470801 -0.292365
H  -7.223351 0.12231 -0.716034
elementType: O N C H
totalener: -1094.87793998 hartree
nucrepener: 2036.69315919 hartree
electener: -3131.57109917 hartree
oneelecener: -5535.64904247 hartree
twoeener: 2404.07794330 hartree
cpcmener: -0.02985647 hartree
kineticenergy: 1090.03317114 hartree
xcener: -105.969424994731 hartree
chargesum: -0.0000000
charge: -0.279742 -0.471130 -0.407258 -0.407641 -0.115913 0.112435 0.042885 -0.098056 -0.263058 -0.283943 -0.317132 0.402240 -0.016085 0.091452 -0.221362 -0.285178 -0.067974 -0.075274 -0.070880 -0.075269 -0.136790 -0.133548 0.316609 0.320916 0.112970 0.094869 0.093890 0.086985 0.094040 0.096405 0.096808 0.102637 0.122771 0.131920 0.128597 0.092183 0.095378 0.086226 0.107435 0.093924 0.095985 0.093430 0.100697 0.093795 0.101258 0.078465 0.080950 0.077697 0.080380
qa: -0.2797 -0.4711 -0.4073 -0.4076 -0.1159 0.1124 0.0429 -0.0981 -0.2631 -0.2839 -0.3171 0.4022 -0.0161 0.0915 -0.2214 -0.2852 -0.0680 -0.0753 -0.0709 -0.0753 -0.1368 -0.1335 0.3166 0.3209 0.1130 0.0949 0.0939 0.0870 0.0940 0.0964 0.0968 0.1026 0.1228 0.1319 0.1286 0.0922 0.0954 0.0862 0.1074 0.0939 0.0960 0.0934 0.1007 0.0938 0.1013 0.0785 0.0810 0.0777 0.0804
va: 2.1151 2.0229 2.1107 2.1102 3.1293 3.7053 3.7337 3.9098 3.9140 3.9082 3.8902 4.0771 3.7268 3.8910 3.9294 3.9458 3.6654 3.6727 3.9204 3.9241 3.9160 3.9130 4.2184 4.2166 1.0033 1.0274 1.0025 1.0050 1.0018 1.0011 1.0131 0.9992 1.0238 1.0021 1.0032 0.9955 0.9936 1.0099 0.9931 1.0006 1.0018 1.0156 1.0046 1.0151 1.0052 1.0068 1.0096 1.0067 1.0097
dispcorr: -0.021711403 hartree
energy: -1094.899651382105
dipole: 18.01859 -19.60143 -1.58284 14.25076 -13.27099 0.97976 -3.03530 1.92012 -1.11518
magnitude: 2.17001 au
magnitude: 5.51572 debye
