program: Orca
programVersion: 5.0.2
elementType: O O O O N C C C C C C C C C C C C C C C C C C C H H H H H H H H H H H H H H H H H H H H H H H H H
charge: 0
multiplicity: 1
keywords: wb97x-d3
keywords: def2-TZVPP
keywords: def2/J RIJCOSX
keywords: DEFGRID2
keywords: scfconv7
keywords: smallprint printgap noloewdin
keywords: NOSOSCF
formula: C19H25NO4
InChI: InChI=1/C19H25NO4/c1-11(2)9-14-15(19(14,3)4)18(23)24-10-20-16(21)12-7-5-6-8-13(12)17(20)22/h9,14-15H,5-8,10H2,1-4H3
49 atoms
O  0.442212 -0.764936 0.356665
O  1.988103 -0.210082 1.862439
O  -2.182548 1.356372 0.797237
O  -2.078179 -3.163463 0.358029
N  -1.807728 -0.91727 0.802495
C  4.033931 -0.363275 -0.460719
C  3.428617 0.98586 -0.698121
C  2.525201 -0.230895 -0.486005
C  4.62532 -1.069189 -1.658102
C  4.791388 -0.638455 0.814608
C  3.508112 2.095589 0.275818
C  1.675344 -0.385272 0.708359
C  4.075248 3.283386 0.038687
C  -0.519263 -0.928415 1.398602
C  4.063067 4.360701 1.080846
C  4.750215 3.664608 -1.244366
C  -3.768244 -0.197865 -0.168645
C  -3.736107 -1.524866 -0.29962
C  -4.871026 0.680802 -0.62851
C  -4.792106 -2.343249 -0.944244
C  -6.100254 -0.170668 -0.952338
C  -5.733167 -1.431513 -1.734461
C  -2.528266 0.237992 0.518347
C  -2.475326 -2.028905 0.301011
H  3.429744 1.299134 -1.736728
H  2.047937 -0.58612 -1.391956
H  4.623579 -2.151992 -1.51549
H  4.072631 -0.854611 -2.573975
H  5.660015 -0.757205 -1.814999
H  4.718697 -1.691613 1.092986
H  5.848446 -0.41637 0.653815
H  4.463348 -0.046096 1.663619
H  3.066884 1.939708 1.253405
H  -0.453628 -0.119353 2.124862
H  -0.362459 -1.877697 1.910923
H  3.529801 4.058174 1.982173
H  5.079353 4.643417 1.36846
H  3.588031 5.268807 0.699152
H  4.173755 4.426219 -1.776709
H  5.728457 4.107657 -1.043169
H  4.90531 2.829297 -1.924269
H  -5.103225 1.429481 0.132593
H  -4.542498 1.240555 -1.510318
H  -4.345401 -3.100651 -1.592856
H  -5.341347 -2.894339 -0.173818
H  -6.596001 -0.454511 -0.019624
H  -6.818024 0.425024 -1.518093
H  -5.251517 -1.147141 -2.674458
H  -6.636221 -1.982403 -2.00115
elementType: O N C H
totalener: -1094.87755004 hartree
nucrepener: 2044.03901650 hartree
electener: -3138.91656654 hartree
oneelecener: -5550.38485453 hartree
twoeener: 2411.46828799 hartree
cpcmener: -0.03010524 hartree
kineticenergy: 1090.02920909 hartree
xcener: -105.968654342142 hartree
chargesum: -0.0000000
charge: -0.279010 -0.469589 -0.408469 -0.407801 -0.110573 0.149575 0.009423 -0.119765 -0.266684 -0.285845 -0.303913 0.406388 -0.015900 0.087355 -0.225177 -0.263579 -0.068297 -0.079248 -0.073646 -0.070705 -0.135395 -0.136016 0.319035 0.321195 0.111149 0.097056 0.094676 0.087389 0.093257 0.102686 0.093872 0.099364 0.122220 0.124354 0.135608 0.088733 0.092963 0.092375 0.099853 0.093457 0.089763 0.093867 0.101470 0.093578 0.100253 0.078345 0.080861 0.078566 0.080927
qa: -0.2790 -0.4696 -0.4085 -0.4078 -0.1106 0.1496 0.0094 -0.1198 -0.2667 -0.2858 -0.3039 0.4064 -0.0159 0.0874 -0.2252 -0.2636 -0.0683 -0.0792 -0.0736 -0.0707 -0.1354 -0.1360 0.3190 0.3212 0.1111 0.0971 0.0947 0.0874 0.0933 0.1027 0.0939 0.0994 0.1222 0.1244 0.1356 0.0887 0.0930 0.0924 0.0999 0.0935 0.0898 0.0939 0.1015 0.0936 0.1003 0.0783 0.0809 0.0786 0.0809
va: 2.1167 2.0213 2.1082 2.1093 3.1223 3.6821 3.7750 3.9526 3.9106 3.8999 3.8772 4.0710 3.7300 3.8864 3.9292 3.9466 3.6641 3.6872 3.9216 3.9212 3.9137 3.9154 4.2164 4.2173 1.0045 1.0270 1.0023 1.0047 1.0025 1.0005 1.0019 1.0137 1.0242 1.0091 1.0010 1.0087 0.9968 0.9950 0.9958 0.9982 1.0075 1.0151 1.0049 1.0155 1.0047 1.0068 1.0098 1.0066 1.0095
dispcorr: -0.021888031 hartree
energy: -1094.899438072918
dipole: 18.20844 -19.55219 -1.34375 12.39335 -12.26657 0.12678 -10.04737 8.38394 -1.66342
magnitude: 2.14213 au
magnitude: 5.44485 debye
