program: Orca
programVersion: 5.0.2
elementType: O O O O N C C C C C C C C C C C C C C C C C C C H H H H H H H H H H H H H H H H H H H H H H H H H
charge: 0
multiplicity: 1
keywords: wb97x-d3
keywords: def2-TZVPP
keywords: def2/J RIJCOSX
keywords: DEFGRID2
keywords: scfconv7
keywords: smallprint printgap noloewdin
keywords: NOSOSCF
formula: C19H25NO4
InChI: InChI=1/C19H25NO4/c1-11(2)9-14-15(19(14,3)4)18(23)24-10-20-16(21)12-7-5-6-8-13(12)17(20)22/h9,14-15H,5-8,10H2,1-4H3
49 atoms
O  1.202905 -1.804933 -1.11899
O  1.275616 -1.206906 1.032294
O  -1.223321 -0.645782 -2.693601
O  -1.574597 -2.189312 1.570414
N  -1.104991 -1.677867 -0.637271
C  4.065402 -0.017512 0.435137
C  3.118527 1.042653 -0.007188
C  2.932763 -0.399374 -0.499213
C  5.432107 -0.03339 -0.208839
C  4.097364 -0.479602 1.871324
C  2.151765 1.693258 0.910816
C  1.748454 -1.156887 -0.075338
C  1.00177 2.255598 0.529923
C  0.006056 -2.536972 -0.899767
C  0.103822 2.93894 1.51413
C  0.511402 2.253315 -0.884085
C  -2.606852 0.059495 -0.834408
C  -2.690814 -0.385644 0.41968
C  -3.382079 1.196932 -1.387357
C  -3.581292 0.167281 1.467861
C  -3.972407 2.009011 -0.233545
C  -4.602884 1.111691 0.831076
C  -1.589406 -0.750018 -1.550516
C  -1.744162 -1.516054 0.588625
H  3.488214 1.685002 -0.802216
H  3.218256 -0.567661 -1.530857
H  5.400586 0.309452 -1.244085
H  6.118937 0.618438 0.334679
H  5.854977 -1.039718 -0.203967
H  3.14585 -0.401079 2.388673
H  4.423042 -1.519868 1.933099
H  4.821952 0.121068 2.425818
H  2.4246 1.743199 1.960644
H  0.105721 -3.245404 -0.077321
H  -0.15532 -3.091724 -1.821679
H  0.534968 2.973325 2.514581
H  -0.115438 3.964307 1.205163
H  -0.859738 2.425292 1.581994
H  1.074613 1.590477 -1.53881
H  -0.538799 1.956562 -0.925619
H  0.556585 3.259522 -1.311173
H  -2.746947 1.820301 -2.021613
H  -4.175553 0.815387 -2.038769
H  -4.079941 -0.639675 2.010367
H  -2.971745 0.693869 2.210135
H  -3.180514 2.611582 0.222094
H  -4.714455 2.709329 -0.619739
H  -5.403575 0.520635 0.376311
H  -5.069092 1.72147 1.606709
elementType: O N C H
totalener: -1094.87538859 hartree
nucrepener: 2234.45677058 hartree
electener: -3329.33215917 hartree
oneelecener: -5931.55667573 hartree
twoeener: 2602.22451655 hartree
cpcmener: -0.03405340 hartree
kineticenergy: 1090.04822519 hartree
xcener: -105.974666603434 hartree
chargesum: -0.0000000
charge: -0.284620 -0.452827 -0.406584 -0.400043 -0.090508 0.140177 -0.019258 -0.120058 -0.262400 -0.299376 -0.266629 0.395424 -0.007802 0.085401 -0.221992 -0.242345 -0.101277 -0.046360 -0.073823 -0.085224 -0.150317 -0.124759 0.284497 0.312494 0.113727 0.094978 0.085802 0.094097 0.095355 0.095850 0.100377 0.097756 0.120885 0.130943 0.140852 0.093586 0.098085 0.076088 0.094772 0.051738 0.119144 0.096310 0.111074 0.099386 0.103037 0.080695 0.084625 0.077727 0.081322
qa: -0.2846 -0.4528 -0.4066 -0.4000 -0.0905 0.1402 -0.0193 -0.1201 -0.2624 -0.2994 -0.2666 0.3954 -0.0078 0.0854 -0.2220 -0.2423 -0.1013 -0.0464 -0.0738 -0.0852 -0.1503 -0.1248 0.2845 0.3125 0.1137 0.0950 0.0858 0.0941 0.0954 0.0959 0.1004 0.0978 0.1209 0.1309 0.1409 0.0936 0.0981 0.0761 0.0948 0.0517 0.1191 0.0963 0.1111 0.0994 0.1030 0.0807 0.0846 0.0777 0.0813
va: 2.1102 2.0395 2.1033 2.1155 3.0628 3.7435 3.8172 3.8263 3.8987 3.8948 3.8598 4.1104 3.6804 3.9027 3.9321 3.9449 3.6321 3.5918 3.8868 3.9199 3.9169 3.8999 4.2034 4.2158 1.0043 1.0301 1.0047 1.0023 1.0026 1.0168 1.0006 0.9987 1.0023 1.0157 0.9945 1.0110 0.9959 0.9970 1.0121 1.0101 0.9993 1.0111 1.0038 1.0159 1.0036 1.0061 1.0118 1.0068 1.0101
dispcorr: -0.028539313 hartree
energy: -1094.903927901470
dipole: 6.80096 -7.42793 -0.62697 20.08719 -18.76882 1.31836 6.04062 -6.54005 -0.49942
magnitude: 1.54292 au
magnitude: 3.92179 debye
