program: Orca
programVersion: 5.0.2
elementType: O O O O N C C C C C C C C C C C C C C C C C C C H H H H H H H H H H H H H H H H H H H H H H H H H
charge: 0
multiplicity: 1
keywords: wb97x-d3
keywords: def2-TZVPP
keywords: def2/J RIJCOSX
keywords: DEFGRID2
keywords: scfconv7
keywords: smallprint printgap noloewdin
keywords: NOSOSCF
formula: C19H25NO4
InChI: InChI=1/C19H25NO4/c1-11(2)9-14-15(19(14,3)4)18(23)24-10-20-16(21)12-7-5-6-8-13(12)17(20)22/h9,14-15H,5-8,10H2,1-4H3
49 atoms
O  0.494607 -0.186513 -0.62259
O  1.539754 1.787942 -0.453302
O  -1.598248 1.067575 1.416906
O  -2.626004 -1.546448 -2.153193
N  -1.815594 -0.081326 -0.564319
C  3.465438 0.35805 1.510138
C  4.031786 0.088231 0.160904
C  2.550437 -0.196769 0.430172
C  3.797063 -0.622728 2.611095
C  3.315991 1.771383 2.016638
C  4.476303 1.172403 -0.749389
C  1.513003 0.601738 -0.237821
C  4.41714 1.126344 -2.08232
C  -0.649225 0.411587 -1.217713
C  4.912085 2.261151 -2.92472
C  3.824266 -0.022227 -2.839229
C  -3.440608 -0.45839 1.022515
C  -3.736241 -1.22777 -0.026243
C  -4.242856 -0.367551 2.266782
C  -4.906717 -2.13405 -0.118635
C  -5.618057 -0.996028 2.032101
C  -5.520889 -2.317348 1.270476
C  -2.194802 0.288469 0.71896
C  -2.701526 -1.023033 -1.07164
H  4.603229 -0.833496 0.079588
H  2.299084 -1.245701 0.534929
H  4.736713 -0.349392 3.095889
H  3.018916 -0.629594 3.376944
H  3.903634 -1.641281 2.235154
H  2.482903 1.840149 2.719031
H  4.220802 2.058888 2.556645
H  3.152426 2.509303 1.236957
H  4.902095 2.056895 -0.284071
H  -0.690348 0.129674 -2.268687
H  -0.612535 1.496839 -1.145345
H  5.293649 3.085652 -2.322218
H  5.711024 1.936051 -3.59649
H  4.113522 2.651456 -3.561663
H  3.6445 -0.900257 -2.220772
H  2.870267 0.267084 -3.290386
H  4.473917 -0.322752 -3.66527
H  -3.714037 -0.881326 3.076284
H  -4.338043 0.673672 2.584108
H  -5.63759 -1.707038 -0.813171
H  -4.612708 -3.095402 -0.546954
H  -6.117408 -1.150893 2.989642
H  -6.239885 -0.296871 1.465124
H  -6.509449 -2.769073 1.176043
H  -4.909455 -3.021003 1.843111
elementType: O N C H
totalener: -1094.87568969 hartree
nucrepener: 2089.48760720 hartree
electener: -3184.36329689 hartree
oneelecener: -5641.65246107 hartree
twoeener: 2457.28916418 hartree
cpcmener: -0.03144781 hartree
kineticenergy: 1090.03997132 hartree
xcener: -105.971412065565 hartree
chargesum: -0.0000000
charge: -0.293076 -0.454249 -0.410995 -0.410691 -0.091797 0.133038 -0.015660 -0.120270 -0.264265 -0.297775 -0.269631 0.408000 -0.018017 0.076803 -0.223226 -0.269076 -0.059746 -0.084132 -0.075256 -0.071165 -0.134640 -0.135686 0.315689 0.319325 0.111918 0.095335 0.094028 0.095749 0.086267 0.100089 0.097912 0.097864 0.118860 0.124052 0.139980 0.088980 0.094854 0.094024 0.095853 0.100871 0.104884 0.100693 0.093629 0.100474 0.093413 0.080615 0.077892 0.080514 0.077750
qa: -0.2931 -0.4542 -0.4110 -0.4107 -0.0918 0.1330 -0.0157 -0.1203 -0.2643 -0.2978 -0.2696 0.4080 -0.0180 0.0768 -0.2232 -0.2691 -0.0597 -0.0841 -0.0753 -0.0712 -0.1346 -0.1357 0.3157 0.3193 0.1119 0.0953 0.0940 0.0957 0.0863 0.1001 0.0979 0.0979 0.1189 0.1241 0.1400 0.0890 0.0949 0.0940 0.0959 0.1009 0.1049 0.1007 0.0936 0.1005 0.0934 0.0806 0.0779 0.0805 0.0778
va: 2.0912 2.0368 2.1065 2.1082 3.0960 3.7350 3.8339 3.8219 3.9021 3.8955 3.8614 4.0847 3.7116 3.8565 3.9270 3.9450 3.6608 3.6973 3.9230 3.9201 3.9127 3.9158 4.2262 4.2292 1.0058 1.0304 1.0020 1.0025 1.0045 1.0014 0.9983 1.0145 1.0015 1.0130 1.0170 1.0072 0.9970 0.9961 1.0045 0.9977 1.0001 1.0049 1.0152 1.0049 1.0157 1.0098 1.0067 1.0097 1.0066
dispcorr: -0.023414573 hartree
energy: -1094.899104258180
dipole: 15.34769 -16.48117 -1.13348 -0.20089 -1.13986 -1.34075 4.77942 -4.05363 0.72579
magnitude: 1.89978 au
magnitude: 4.82885 debye
