program: Orca
programVersion: 5.0.2
elementType: O O O O N C C C C C C C C C C C C C C C C C C C H H H H H H H H H H H H H H H H H H H H H H H H H
charge: 0
multiplicity: 1
keywords: wb97x-d3
keywords: def2-TZVPP
keywords: def2/J RIJCOSX
keywords: DEFGRID2
keywords: scfconv7
keywords: smallprint printgap noloewdin
keywords: NOSOSCF
formula: C19H25NO4
InChI: InChI=1/C19H25NO4/c1-11(2)9-14-15(19(14,3)4)18(23)24-10-20-16(21)12-7-5-6-8-13(12)17(20)22/h9,14-15H,5-8,10H2,1-4H3
49 atoms
O  1.302753 -1.460067 0.188204
O  2.106883 -2.328222 -1.710844
O  -1.453902 -1.300893 2.391092
O  -1.062326 -1.042032 -2.124739
N  -1.016625 -1.49385 0.134619
C  3.969598 -0.026461 0.485735
C  3.03778 0.916829 -0.196809
C  3.235049 -0.496271 -0.758189
C  5.449581 0.202815 0.281561
C  3.660866 -0.581797 1.854766
C  1.780799 1.395124 0.426585
C  2.176521 -1.515478 -0.819348
C  0.845979 2.128574 -0.185057
C  0.156816 -2.299343 0.17993
C  -0.33367 2.661087 0.570065
C  0.878365 2.484408 -1.639404
C  -2.768081 -0.125282 0.733524
C  -2.655265 -0.048538 -0.593143
C  -3.783781 0.584703 1.547304
C  -3.516996 0.774567 -1.475873
C  -4.88101 1.12965 0.631226
C  -4.305411 1.774417 -0.628288
C  -1.701774 -1.019278 1.247151
C  -1.511042 -0.892769 -1.01725
H  3.524362 1.654054 -0.829052
H  3.851729 -0.541509 -1.648433
H  5.669561 0.600292 -0.710191
H  5.830882 0.91567 1.015769
H  6.010624 -0.726613 0.399517
H  2.603233 -0.704449 2.067839
H  4.138328 -1.554661 1.987444
H  4.069543 0.08646 2.615753
H  1.640788 1.178068 1.480902
H  0.156021 -2.872896 1.104318
H  0.166977 -2.986564 -0.663202
H  -0.347522 2.321272 1.606096
H  -0.327665 3.755057 0.577238
H  -1.274712 2.363903 0.100785
H  0.006572 2.065725 -2.151238
H  0.826636 3.567609 -1.779404
H  1.765454 2.119648 -2.15552
H  -4.202379 -0.084465 2.302999
H  -3.298634 1.395941 2.10068
H  -2.912223 1.288129 -2.227484
H  -4.194542 0.118678 -2.032463
H  -5.550447 0.312832 0.346002
H  -5.487643 1.852937 1.17803
H  -3.647985 2.600841 -0.342655
H  -5.107948 2.20737 -1.227147
elementType: O N C H
totalener: -1094.87343399 hartree
nucrepener: 2228.97869122 hartree
electener: -3323.85212522 hartree
oneelecener: -5919.91612829 hartree
twoeener: 2596.06400307 hartree
cpcmener: -0.03362835 hartree
kineticenergy: 1090.04915941 hartree
xcener: -105.975790187376 hartree
chargesum: -0.0000000
charge: -0.262573 -0.458955 -0.411369 -0.404716 -0.080495 0.143104 -0.036425 -0.141765 -0.261275 -0.289145 -0.238087 0.418861 -0.033704 0.063063 -0.221808 -0.261540 -0.095475 -0.040594 -0.071886 -0.075311 -0.131032 -0.145755 0.322948 0.277012 0.110434 0.091926 0.087091 0.093364 0.095500 0.088019 0.103043 0.099401 0.123260 0.125125 0.140953 0.093320 0.113098 0.055825 0.090456 0.101760 0.091600 0.097807 0.101784 0.097522 0.107049 0.077753 0.081083 0.083333 0.086417
qa: -0.2626 -0.4590 -0.4114 -0.4047 -0.0805 0.1431 -0.0364 -0.1418 -0.2613 -0.2891 -0.2381 0.4189 -0.0337 0.0631 -0.2218 -0.2615 -0.0955 -0.0406 -0.0719 -0.0753 -0.1310 -0.1458 0.3229 0.2770 0.1104 0.0919 0.0871 0.0934 0.0955 0.0880 0.1030 0.0994 0.1233 0.1251 0.1410 0.0933 0.1131 0.0558 0.0905 0.1018 0.0916 0.0978 0.1018 0.0975 0.1070 0.0778 0.0811 0.0833 0.0864
va: 2.0982 2.0549 2.1023 2.1043 3.1006 3.7563 3.7779 3.8638 3.8969 3.9016 3.8250 4.1468 3.6947 3.8670 3.9292 3.9492 3.6709 3.5778 3.9151 3.8964 3.9111 3.9103 4.1910 4.2091 1.0025 1.0287 1.0055 1.0023 1.0021 1.0155 1.0004 0.9989 1.0029 1.0128 1.0227 1.0084 0.9996 0.9993 1.0027 0.9985 1.0074 1.0161 1.0058 1.0145 1.0047 1.0071 1.0102 1.0029 1.0110
dispcorr: -0.028756248 hartree
energy: -1094.902190239694
dipole: 3.61797 -4.93527 -1.31731 20.48239 -18.62776 1.85463 3.42634 -2.59331 0.83303
magnitude: 2.42258 au
magnitude: 6.15770 debye
