program: Orca
programVersion: 5.0.2
elementType: O O O O N C C C C C C C C C C C C C C C C C C C H H H H H H H H H H H H H H H H H H H H H H H H H
charge: 0
multiplicity: 1
keywords: wb97x-d3
keywords: def2-TZVPP
keywords: def2/J RIJCOSX
keywords: DEFGRID2
keywords: scfconv7
keywords: smallprint printgap noloewdin
keywords: NOSOSCF
formula: C19H25NO4
InChI: InChI=1/C19H25NO4/c1-11(2)9-14-15(19(14,3)4)18(23)24-10-20-16(21)12-7-5-6-8-13(12)17(20)22/h9,14-15H,5-8,10H2,1-4H3
49 atoms
O  1.299621 -1.406332 0.164205
O  2.139917 -2.307249 -1.703363
O  -1.453925 -1.351098 2.409238
O  -1.090396 -0.945703 -2.097879
N  -1.017752 -1.45511 0.147036
C  3.979424 -0.021681 0.518853
C  3.079542 0.936446 -0.183516
C  3.266557 -0.47661 -0.744692
C  5.467353 0.182283 0.34762
C  3.63063 -0.582617 1.876067
C  1.804441 1.427497 0.391844
C  2.196611 -1.482935 -0.821386
C  0.876622 2.11208 -0.28264
C  0.160412 -2.254593 0.154827
C  -0.347358 2.640142 0.400767
C  0.952845 2.391202 -1.752267
C  -2.797545 -0.146621 0.795398
C  -2.688937 -0.021972 -0.527902
C  -3.823715 0.519115 1.633813
C  -3.558992 0.823175 -1.380854
C  -4.930527 1.076701 0.737153
C  -4.367159 1.776611 -0.498576
C  -1.710519 -1.034814 1.276495
C  -1.532553 -0.832647 -0.98318
H  3.594423 1.668045 -0.800349
H  3.902055 -0.534317 -1.620843
H  5.71426 0.59247 -0.632493
H  5.848601 0.87431 1.101387
H  6.007948 -0.759903 0.459221
H  4.054421 -1.581482 1.997687
H  4.067015 0.051182 2.650915
H  2.566053 -0.651136 2.078866
H  1.636622 1.248503 1.44934
H  0.175965 -2.852085 1.06408
H  0.161544 -2.91967 -0.705875
H  -0.354158 3.733843 0.398646
H  -1.25652 2.329295 -0.11924
H  -0.419108 2.307475 1.436587
H  1.92946 2.1799 -2.184903
H  0.220077 1.783469 -2.291358
H  0.707295 3.433394 -1.968381
H  -4.230108 -0.180253 2.368494
H  -3.351481 1.320676 2.21163
H  -2.955935 1.376458 -2.105476
H  -4.222726 0.182219 -1.970297
H  -5.585623 0.258692 0.423752
H  -5.549687 1.769232 1.308992
H  -3.725495 2.604197 -0.182077
H  -5.177526 2.215961 -1.082022
elementType: O N C H
totalener: -1094.87324229 hartree
nucrepener: 2227.95791631 hartree
electener: -3322.83115860 hartree
oneelecener: -5917.84942117 hartree
twoeener: 2595.01826256 hartree
cpcmener: -0.03316781 hartree
kineticenergy: 1090.05373960 hartree
xcener: -105.976901837501 hartree
chargesum: 0.0000000
charge: -0.262301 -0.460088 -0.411194 -0.405584 -0.076690 0.140127 -0.044072 -0.140379 -0.263212 -0.286454 -0.236081 0.420141 -0.021533 0.063472 -0.233857 -0.266072 -0.092376 -0.044036 -0.068730 -0.071324 -0.132631 -0.146725 0.326749 0.267864 0.111163 0.091084 0.086846 0.093134 0.096069 0.103799 0.098101 0.086426 0.123424 0.125055 0.140813 0.113628 0.064997 0.094218 0.093724 0.091509 0.101900 0.096248 0.101263 0.096973 0.108197 0.077937 0.080976 0.081613 0.085888
qa: -0.2623 -0.4601 -0.4112 -0.4056 -0.0767 0.1401 -0.0441 -0.1404 -0.2632 -0.2865 -0.2361 0.4201 -0.0215 0.0635 -0.2339 -0.2661 -0.0924 -0.0440 -0.0687 -0.0713 -0.1326 -0.1467 0.3267 0.2679 0.1112 0.0911 0.0868 0.0931 0.0961 0.1038 0.0981 0.0864 0.1234 0.1251 0.1408 0.1136 0.0650 0.0942 0.0937 0.0915 0.1019 0.0962 0.1013 0.0970 0.1082 0.0779 0.0810 0.0816 0.0859
va: 2.0967 2.0541 2.1031 2.1005 3.1006 3.7556 3.7871 3.8609 3.8996 3.9019 3.8223 4.1443 3.6955 3.8615 3.9393 3.9448 3.6798 3.5805 3.9146 3.8883 3.9104 3.9116 4.1858 4.2073 1.0025 1.0290 1.0056 1.0025 1.0018 1.0000 0.9995 1.0160 1.0022 1.0128 1.0233 0.9987 0.9948 1.0069 1.0073 1.0056 0.9992 1.0157 1.0064 1.0145 1.0044 1.0069 1.0099 1.0047 1.0111
dispcorr: -0.028834371 hartree
energy: -1094.902076658887
dipole: 3.55143 -4.89873 -1.34730 19.90403 -18.09249 1.81154 3.26213 -2.40605 0.85608
magnitude: 2.41450 au
magnitude: 6.13716 debye
