program: Orca
programVersion: 5.0.2
elementType: O O O O N C C C C C C C C C C C C C C C C C C C H H H H H H H H H H H H H H H H H H H H H H H H H
charge: 0
multiplicity: 1
keywords: wb97x-d3
keywords: def2-TZVPP
keywords: def2/J RIJCOSX
keywords: DEFGRID2
keywords: scfconv7
keywords: smallprint printgap noloewdin
keywords: NOSOSCF
formula: C19H25NO4
InChI: InChI=1/C19H25NO4/c1-11(2)9-14-15(19(14,3)4)18(23)24-10-20-16(21)12-7-5-6-8-13(12)17(20)22/h9,14-15H,5-8,10H2,1-4H3
49 atoms
O  0.895212 -0.999243 -1.497547
O  0.604985 1.029219 -0.603462
O  -0.992891 -3.100725 -0.153157
O  -2.440668 1.02942 -1.383275
N  -1.428554 -1.019992 -1.039757
C  3.020355 0.038132 1.188649
C  3.572968 0.973648 0.170317
C  2.665915 -0.163591 -0.279272
C  3.949149 -1.00307 1.765098
C  1.973796 0.507422 2.167068
C  3.193507 2.408454 0.113913
C  1.304028 0.064045 -0.783593
C  3.128246 3.146961 -0.995393
C  -0.412914 -0.985464 -2.044286
C  2.792585 4.605457 -0.942833
C  3.348685 2.59225 -2.36803
C  -2.724145 -1.666534 0.751318
C  -3.134952 -0.449256 0.395907
C  -3.300996 -2.471514 1.855308
C  -4.2238 0.312767 1.052948
C  -4.637968 -1.863685 2.285036
C  -4.567468 -0.34109 2.392352
C  -1.618713 -2.071431 -0.15364
C  -2.32977 0.003509 -0.765318
H  4.607711 0.780381 -0.103354
H  3.167625 -0.998843 -0.753627
H  3.396103 -1.886501 2.089969
H  4.697559 -1.327376 1.041047
H  4.479121 -0.605632 2.633435
H  2.459172 0.903619 3.061573
H  1.322947 1.287155 1.778909
H  1.342379 -0.326149 2.481797
H  3.00144 2.893954 1.06684
H  -0.463972 -1.878031 -2.663697
H  -0.578251 -0.111381 -2.67404
H  3.586921 5.210275 -1.387681
H  1.885847 4.818866 -1.515122
H  2.635249 4.956055 0.07723
H  3.625119 1.53954 -2.368563
H  2.445337 2.701291 -2.974364
H  4.135316 3.143883 -2.889108
H  -3.427357 -3.510957 1.543861
H  -2.596653 -2.49251 2.693249
H  -3.927757 1.355137 1.192259
H  -5.097849 0.334762 0.393968
H  -5.407315 -2.139823 1.55821
H  -4.943159 -2.292553 3.24044
H  -3.809634 -0.064741 3.131183
H  -5.516982 0.052714 2.757816
elementType: O N C H
totalener: -1094.87570601 hartree
nucrepener: 2153.86197722 hartree
electener: -3248.73768323 hartree
oneelecener: -5770.80560040 hartree
twoeener: 2522.06791717 hartree
cpcmener: -0.03355865 hartree
kineticenergy: 1090.05695755 hartree
xcener: -105.974938911658 hartree
chargesum: -0.0000000
charge: -0.286397 -0.453772 -0.411232 -0.403310 -0.100325 0.136698 -0.018798 -0.125702 -0.264566 -0.299833 -0.265099 0.404776 -0.022731 0.083114 -0.225283 -0.267826 -0.080134 -0.066271 -0.072428 -0.076466 -0.136547 -0.134222 0.311555 0.316110 0.115590 0.095842 0.095537 0.086087 0.094218 0.101810 0.097493 0.099966 0.120495 0.142309 0.131335 0.094483 0.094439 0.088537 0.093198 0.098788 0.105192 0.092632 0.100716 0.094118 0.100407 0.077608 0.080250 0.077833 0.079806
qa: -0.2864 -0.4538 -0.4112 -0.4033 -0.1003 0.1367 -0.0188 -0.1257 -0.2646 -0.2998 -0.2651 0.4048 -0.0227 0.0831 -0.2253 -0.2678 -0.0801 -0.0663 -0.0724 -0.0765 -0.1365 -0.1342 0.3116 0.3161 0.1156 0.0958 0.0955 0.0861 0.0942 0.1018 0.0975 0.1000 0.1205 0.1423 0.1313 0.0945 0.0944 0.0885 0.0932 0.0988 0.1052 0.0926 0.1007 0.0941 0.1004 0.0776 0.0802 0.0778 0.0798
va: 2.1098 2.0382 2.1054 2.1133 3.0692 3.7353 3.8363 3.8187 3.9014 3.9056 3.8593 4.0924 3.7083 3.8964 3.9262 3.9454 3.6851 3.6548 3.9185 3.9194 3.9150 3.9154 4.2194 4.2142 1.0035 1.0306 1.0024 1.0052 1.0016 0.9989 1.0132 1.0013 1.0002 0.9932 1.0163 0.9967 0.9966 1.0074 1.0048 0.9985 1.0000 1.0158 1.0049 1.0154 1.0048 1.0064 1.0096 1.0067 1.0096
dispcorr: -0.024529055 hartree
energy: -1094.900235069399
dipole: 11.42465 -11.77314 -0.34848 10.89278 -11.47623 -0.58345 11.77903 -10.86394 0.91509
magnitude: 1.13985 au
magnitude: 2.89727 debye
