program: Orca
programVersion: 5.0.2
elementType: O O O O N C C C C C C C C C C C C C C C C C C C H H H H H H H H H H H H H H H H H H H H H H H H H
charge: 0
multiplicity: 1
keywords: wb97x-d3
keywords: def2-TZVPP
keywords: def2/J RIJCOSX
keywords: DEFGRID2
keywords: scfconv7
keywords: smallprint printgap noloewdin
keywords: NOSOSCF
formula: C19H25NO4
InChI: InChI=1/C19H25NO4/c1-11(2)9-14-15(19(14,3)4)18(23)24-10-20-16(21)12-7-5-6-8-13(12)17(20)22/h9,14-15H,5-8,10H2,1-4H3
49 atoms
O  0.688322 -0.698376 -0.255507
O  2.323452 -1.278761 1.147635
O  -1.927406 -2.660387 -1.513312
O  -1.827678 0.806644 1.434427
N  -1.542248 -1.073447 0.122173
C  4.277056 0.166072 -0.769821
C  3.642448 1.29209 -0.027276
C  2.767813 0.218561 -0.681283
C  4.838554 0.477315 -2.138722
C  5.075268 -0.88424 -0.036653
C  3.731766 1.431444 1.447307
C  1.960496 -0.66975 0.177814
C  2.792405 1.98491 2.214256
C  -0.231268 -1.44172 0.529961
C  2.967947 2.106885 3.696891
C  1.491855 2.502211 1.681012
C  -3.498358 -0.873005 -1.074998
C  -3.471453 0.137486 -0.206888
C  -4.591381 -1.136347 -2.0437
C  -4.537902 1.156858 -0.047467
C  -5.496446 0.093901 -2.140615
C  -5.804906 0.684956 -0.764282
C  -2.259585 -1.680846 -0.907518
C  -2.209694 0.061259 0.575571
H  3.604613 2.236534 -0.565255
H  2.25452 0.531104 -1.583517
H  5.866066 0.837616 -2.059075
H  4.846106 -0.412782 -2.770417
H  4.26029 1.245238 -2.654776
H  6.113973 -0.557332 0.045776
H  4.704606 -1.094574 0.961117
H  5.070796 -1.822738 -0.593322
H  4.638072 1.066995 1.919961
H  -0.106572 -1.218975 1.589288
H  -0.095989 -2.511933 0.371285
H  3.922558 1.703418 4.031937
H  2.910274 3.15021 4.01708
H  2.1737 1.573531 4.224737
H  1.416358 2.437176 0.597511
H  0.649113 1.948682 2.101638
H  1.346664 3.54789 1.963994
H  -4.17826 -1.401095 -3.019561
H  -5.160932 -2.012456 -1.716666
H  -4.729266 1.34267 1.011769
H  -4.190915 2.111324 -0.456407
H  -5.006426 0.852717 -2.757422
H  -6.423261 -0.169037 -2.652306
H  -6.303078 -0.071104 -0.150474
H  -6.505661 1.515352 -0.86135
totalener: -1094.85230690 hartree
nucrepener: 2105.60304446 hartree
electener: -3200.45535136 hartree
oneelecener: -5673.27759024 hartree
twoeener: 2472.82223888 hartree
kineticenergy: 1090.09804612 hartree
xcener: -105.971841491600 hartree
chargesum: -0.0000000
charge: -0.265420 -0.374471 -0.315655 -0.335711 -0.119276 0.143554 -0.056193 -0.100544 -0.243490 -0.280316 -0.195910 0.329723 0.005817 0.078242 -0.208140 -0.249455 -0.099529 -0.066520 -0.073779 -0.074015 -0.136466 -0.134276 0.266496 0.262523 0.093788 0.083187 0.087369 0.091343 0.069555 0.086156 0.107966 0.086372 0.083693 0.124464 0.124747 0.076681 0.082482 0.089084 0.078569 0.098474 0.092153 0.095079 0.092994 0.093489 0.092815 0.076127 0.080478 0.075375 0.080373
qa: -0.2654 -0.3745 -0.3157 -0.3357 -0.1193 0.1436 -0.0562 -0.1005 -0.2435 -0.2803 -0.1959 0.3297 0.0058 0.0782 -0.2081 -0.2495 -0.0995 -0.0665 -0.0738 -0.0740 -0.1365 -0.1343 0.2665 0.2625 0.0938 0.0832 0.0874 0.0913 0.0696 0.0862 0.1080 0.0864 0.0837 0.1245 0.1247 0.0767 0.0825 0.0891 0.0786 0.0985 0.0922 0.0951 0.0930 0.0935 0.0928 0.0761 0.0805 0.0754 0.0804
va: 2.0958 2.1067 2.1979 2.1746 3.1059 3.7292 3.9018 3.8413 3.9040 3.9090 3.8945 4.1612 3.7421 3.9147 3.9401 3.9450 3.6536 3.6270 3.9238 3.9259 3.8999 3.8971 4.2715 4.2506 1.0059 1.0297 1.0049 1.0048 1.0074 0.9975 1.0178 1.0054 1.0127 1.0036 1.0048 1.0108 0.9989 0.9994 1.0102 1.0106 1.0025 1.0190 1.0080 1.0192 1.0086 1.0086 1.0117 1.0088 1.0117
dispcorr: -0.024066021 hartree
energy: -1094.876372923118
dipole: 10.72624 -12.04949 -1.32325 13.40775 -12.61309 0.79466 0.27087 -0.99522 -0.72435
magnitude: 1.70504 au
magnitude: 4.33387 debye
