program: Orca
programVersion: 5.0.2
elementType: O O O O N C C C C C C C C C C C C C C C C C C C H H H H H H H H H H H H H H H H H H H H H H H H H
charge: 0
multiplicity: 1
keywords: wb97x-d3
keywords: def2-TZVPP
keywords: def2/J RIJCOSX
keywords: DEFGRID2
keywords: scfconv7
keywords: smallprint printgap noloewdin
keywords: NOSOSCF
formula: C19H25NO4
InChI: InChI=1/C19H25NO4/c1-11(2)9-14-15(19(14,3)4)18(23)24-10-20-16(21)12-7-5-6-8-13(12)17(20)22/h9,14-15H,5-8,10H2,1-4H3
49 atoms
O  1.176967 -1.10302 -0.48853
O  2.689998 -2.159213 -1.7386
O  -1.437689 0.109195 -2.404341
O  -1.2445 -2.236786 1.486074
N  -1.087819 -1.327873 -0.62986
C  3.609276 -0.209312 1.18311
C  3.145538 0.925149 0.332571
C  3.430049 -0.427969 -0.309228
C  5.043848 -0.18649 1.658374
C  2.676521 -0.848259 2.183643
C  1.797392 1.533541 0.47137
C  2.421348 -1.319698 -0.91956
C  1.148852 2.18899 -0.49057
C  0.14465 -1.907214 -1.037157
C  -0.162332 2.86615 -0.228014
C  1.651738 2.298086 -1.896272
C  -2.800968 0.194269 -0.407219
C  -2.744401 -0.491548 0.734461
C  -3.77151 1.277956 -0.702979
C  -3.649434 -0.296135 1.894687
C  -4.429274 1.73984 0.598439
C  -4.847706 0.558495 1.474606
C  -1.723439 -0.292026 -1.310055
C  -1.626558 -1.469145 0.648007
H  3.919455 1.649979 0.089186
H  4.358653 -0.489204 -0.865222
H  5.707413 0.28577 0.932899
H  5.129093 0.370006 2.593706
H  5.414171 -1.197345 1.837164
H  1.632384 -0.844865 1.884812
H  2.963319 -1.886127 2.361802
H  2.749118 -0.323439 3.138501
H  1.341591 1.479161 1.455454
H  0.211595 -2.927825 -0.65957
H  0.192355 -1.921889 -2.125512
H  -0.068276 3.950682 -0.32939
H  -0.915415 2.554693 -0.955125
H  -0.541767 2.65588 0.772052
H  1.722054 3.342737 -2.209958
H  2.628518 1.83925 -2.036351
H  0.953764 1.811315 -2.582216
H  -3.272425 2.108689 -1.206904
H  -4.52279 0.911508 -1.410093
H  -3.972906 -1.260863 2.292088
H  -3.093875 0.185353 2.70623
H  -3.725158 2.369886 1.150453
H  -5.294506 2.365494 0.373848
H  -5.558445 -0.064693 0.923808
H  -5.373867 0.916578 2.360792
totalener: -1094.84908603 hartree
nucrepener: 2220.86006343 hartree
electener: -3315.70914946 hartree
oneelecener: -5903.32395422 hartree
twoeener: 2587.61480477 hartree
kineticenergy: 1090.09728894 hartree
xcener: -105.972753374482 hartree
chargesum: 0.0000000
charge: -0.249524 -0.362821 -0.322895 -0.316494 -0.093134 0.128385 -0.036207 -0.142157 -0.246821 -0.274190 -0.180462 0.349736 -0.008033 0.068987 -0.232577 -0.250640 -0.072904 -0.068067 -0.087421 -0.072842 -0.125853 -0.135566 0.209332 0.243120 0.097923 0.088719 0.071366 0.085663 0.093572 0.089207 0.094770 0.087332 0.087663 0.126990 0.126773 0.105113 0.067762 0.077010 0.091154 0.084364 0.103019 0.100845 0.099972 0.094708 0.092574 0.074765 0.080855 0.076213 0.080718
qa: -0.2495 -0.3628 -0.3229 -0.3165 -0.0931 0.1284 -0.0362 -0.1422 -0.2468 -0.2742 -0.1805 0.3497 -0.0080 0.0690 -0.2326 -0.2506 -0.0729 -0.0681 -0.0874 -0.0728 -0.1259 -0.1356 0.2093 0.2431 0.0979 0.0887 0.0714 0.0857 0.0936 0.0892 0.0948 0.0873 0.0877 0.1270 0.1268 0.1051 0.0678 0.0770 0.0912 0.0844 0.1030 0.1008 0.1000 0.0947 0.0926 0.0748 0.0809 0.0762 0.0807
va: 2.0879 2.1438 2.1754 2.1911 3.1094 3.7331 3.8122 3.8661 3.9129 3.9262 3.8576 4.1973 3.7309 3.9230 3.9385 3.9494 3.5866 3.6282 3.9191 3.9220 3.8858 3.8973 4.2459 4.2623 1.0066 1.0278 1.0087 1.0039 1.0040 1.0112 1.0054 0.9999 1.0065 0.9999 1.0085 0.9999 1.0076 1.0086 1.0020 1.0074 1.0054 1.0110 1.0090 1.0176 1.0095 1.0117 1.0126 1.0086 1.0120
dispcorr: -0.028476331 hartree
energy: -1094.877562362644
dipole: 2.57220 -3.82200 -1.24980 17.61961 -16.39762 1.22199 9.93487 -8.96959 0.96528
magnitude: 1.99676 au
magnitude: 5.07536 debye
