program: Orca
programVersion: 5.0.2
elementType: O O O O N C C C C C C C C C C C C C C C C C C C H H H H H H H H H H H H H H H H H H H H H H H H H
charge: 0
multiplicity: 1
keywords: wb97x-d3
keywords: def2-TZVPP
keywords: def2/J RIJCOSX
keywords: DEFGRID2
keywords: scfconv7
keywords: smallprint printgap noloewdin
keywords: NOSOSCF
formula: C19H25NO4
InChI: InChI=1/C19H25NO4/c1-11(2)9-14-15(19(14,3)4)18(23)24-10-20-16(21)12-7-5-6-8-13(12)17(20)22/h9,14-15H,5-8,10H2,1-4H3
49 atoms
O  1.20625 -2.163601 -0.448247
O  1.394959 -0.861977 1.35835
O  -1.424009 -1.654268 2.396627
O  -1.351689 -1.520606 -2.155131
N  -1.063001 -1.832686 0.114241
C  4.010486 0.216433 0.136042
C  2.926914 0.970311 -0.557256
C  2.880645 -0.563854 -0.497441
C  5.330422 0.112113 -0.594616
C  4.184494 0.290791 1.633632
C  1.927009 1.796146 0.158014
C  1.78453 -1.18335 0.269724
C  0.823911 2.299026 -0.398103
C  0.031258 -2.749065 0.079987
C  -0.12204 3.152874 0.389418
C  0.426526 2.055595 -1.822189
C  -2.603925 -0.269657 0.808292
C  -2.610203 -0.25356 -0.523607
C  -3.467921 0.569509 1.6747
C  -3.476931 0.610714 -1.363447
C  -4.600656 1.169559 0.839945
C  -4.097209 1.710089 -0.499011
C  -1.633867 -1.298943 1.273337
C  -1.623649 -1.250382 -1.018153
H  3.184723 1.33561 -1.546797
H  3.113742 -1.073176 -1.425331
H  5.19964 0.06698 -1.676631
H  5.958095 0.977315 -0.374356
H  5.876485 -0.782013 -0.289385
H  4.708733 -0.595411 1.994518
H  4.796685 1.15864 1.885689
H  3.251696 0.359856 2.182849
H  2.117385 2.012924 1.202808
H  0.181714 -3.127458 1.091593
H  -0.190205 -3.574147 -0.593226
H  -0.269657 4.126108 -0.085658
H  -1.107061 2.680902 0.44989
H  0.228236 3.32369 1.406341
H  1.04547 1.313693 -2.321967
H  -0.606046 1.702748 -1.878084
H  0.468022 2.980651 -2.403389
H  -3.8572 -0.020128 2.507488
H  -2.860491 1.358878 2.129895
H  -2.905373 1.036171 -2.191748
H  -4.255232 -0.002318 -1.829287
H  -5.357545 0.401261 0.657082
H  -5.094976 1.963045 1.402383
H  -3.349476 2.487707 -0.31564
H  -4.913155 2.190466 -1.04099
totalener: -1094.84879325 hartree
nucrepener: 2234.69793114 hartree
electener: -3329.54672439 hartree
oneelecener: -5931.47718756 hartree
twoeener: 2601.93046317 hartree
kineticenergy: 1090.11080362 hartree
xcener: -105.976578060873 hartree
chargesum: 0.0000000
charge: -0.264774 -0.376574 -0.301614 -0.314725 -0.118448 0.142836 -0.068482 -0.095394 -0.241181 -0.279637 -0.141406 0.341614 -0.032791 0.086084 -0.187312 -0.243396 -0.046196 -0.147241 -0.090622 -0.083033 -0.119310 -0.155595 0.271473 0.242345 0.089832 0.083839 0.071805 0.088940 0.091341 0.086618 0.089054 0.104210 0.088141 0.127741 0.120801 0.091007 0.031330 0.085963 0.092253 0.056773 0.102563 0.099400 0.097009 0.100746 0.102808 0.074461 0.078827 0.083351 0.084567
qa: -0.2648 -0.3766 -0.3016 -0.3147 -0.1184 0.1428 -0.0685 -0.0954 -0.2412 -0.2796 -0.1414 0.3416 -0.0328 0.0861 -0.1873 -0.2434 -0.0462 -0.1472 -0.0906 -0.0830 -0.1193 -0.1556 0.2715 0.2423 0.0898 0.0838 0.0718 0.0889 0.0913 0.0866 0.0891 0.1042 0.0881 0.1277 0.1208 0.0910 0.0313 0.0860 0.0923 0.0568 0.1026 0.0994 0.0970 0.1007 0.1028 0.0745 0.0788 0.0834 0.0846
va: 2.1277 2.1019 2.2130 2.1972 3.0724 3.7501 3.8720 3.8516 3.8979 3.9067 3.8804 4.1597 3.7401 3.9244 3.9418 3.9505 3.5404 3.6125 3.9196 3.9076 3.8836 3.8993 4.2626 4.2560 1.0046 1.0305 1.0069 1.0045 1.0050 1.0039 0.9982 1.0231 1.0159 1.0139 0.9956 1.0000 1.0078 1.0157 1.0115 1.0096 1.0003 1.0212 1.0055 1.0095 1.0078 1.0090 1.0131 1.0051 1.0145
dispcorr: -0.028235919 hartree
energy: -1094.877029165646
dipole: 5.81864 -6.29410 -0.47546 21.79348 -20.96300 0.83049 -2.31459 1.83799 -0.47661
magnitude: 1.06908 au
magnitude: 2.71738 debye
