program: Orca
programVersion: 5.0.2
elementType: O O O O N C C C C C C C C C C C C C C C C C C C H H H H H H H H H H H H H H H H H H H H H H H H H
charge: 0
multiplicity: 1
keywords: wb97x-d3
keywords: def2-TZVPP
keywords: def2/J RIJCOSX
keywords: DEFGRID2
keywords: scfconv7
keywords: smallprint printgap noloewdin
keywords: NOSOSCF
formula: C19H25NO4
InChI: InChI=1/C19H25NO4/c1-11(2)9-14-15(19(14,3)4)18(23)24-10-20-16(21)12-7-5-6-8-13(12)17(20)22/h9,14-15H,5-8,10H2,1-4H3
49 atoms
O  0.956643 -2.053373 -0.087002
O  2.218471 -1.387217 1.646187
O  -0.788421 0.074951 1.972902
O  -2.256753 -2.899217 -1.146074
N  -1.2510 -1.682544 0.542127
C  4.054591 0.027762 -0.364667
C  2.785072 0.717969 -0.785159
C  2.826499 -0.801393 -0.604059
C  5.124967 -0.107711 -1.423891
C  4.63035 0.260779 1.011912
C  1.982827 1.558388 0.121849
C  2.014237 -1.423978 0.466196
C  1.467514 2.758527 -0.158678
C  -0.093678 -2.489621 0.757376
C  0.623051 3.474642 0.853902
C  1.66204 3.502134 -1.445376
C  -2.648878 0.144451 0.432816
C  -3.086603 -0.729413 -0.472912
C  -3.25592 1.470852 0.704755
C  -4.273682 -0.534505 -1.34198
C  -4.223278 1.828301 -0.425467
C  -5.102532 0.640286 -0.817909
C  -1.453761 -0.424777 1.109443
C  -2.193405 -1.918543 -0.458786
H  2.751867 1.012967 -1.828073
H  2.793429 -1.355851 -1.536033
H  5.783665 -0.949452 -1.202341
H  4.703164 -0.271268 -2.416943
H  5.739718 0.792957 -1.46945
H  3.887483 0.468525 1.774127
H  5.203161 -0.606891 1.341192
H  5.311576 1.112532 0.969227
H  1.772231 1.15415 1.105728
H  0.195166 -2.442486 1.805713
H  -0.333581 -3.514237 0.481527
H  -0.36387 3.707074 0.442919
H  0.475783 2.882267 1.755711
H  1.069683 4.430296 1.140601
H  0.702366 3.701325 -1.929191
H  2.11958 4.476367 -1.256336
H  2.293724 2.982992 -2.16233
H  -3.77562 1.442997 1.667954
H  -2.474811 2.227369 0.812211
H  -3.94333 -0.349592 -2.369288
H  -4.868419 -1.449726 -1.384273
H  -4.845466 2.67343 -0.127463
H  -3.65049 2.156894 -1.297621
H  -5.830391 0.943522 -1.571852
H  -5.677237 0.313558 0.053649
totalener: -1094.84979426 hartree
nucrepener: 2167.11985419 hartree
electener: -3261.96964845 hartree
oneelecener: -5796.21582157 hartree
twoeener: 2534.24617312 hartree
kineticenergy: 1090.09204153 hartree
xcener: -105.970921480827 hartree
chargesum: -0.0000000
charge: -0.262833 -0.350599 -0.314432 -0.319943 -0.111076 0.111460 0.025128 -0.092776 -0.249104 -0.237517 -0.241935 0.314348 -0.037022 0.069754 -0.233331 -0.244282 -0.045637 -0.104122 -0.073896 -0.075009 -0.134616 -0.136809 0.227544 0.273742 0.081614 0.086399 0.090100 0.070137 0.088615 0.098552 0.088730 0.079105 0.115085 0.138702 0.114868 0.066224 0.097214 0.096506 0.084048 0.087852 0.078516 0.094172 0.088946 0.093171 0.093410 0.080180 0.075138 0.079421 0.076258
qa: -0.2628 -0.3506 -0.3144 -0.3199 -0.1111 0.1115 0.0251 -0.0928 -0.2491 -0.2375 -0.2419 0.3143 -0.0370 0.0698 -0.2333 -0.2443 -0.0456 -0.1041 -0.0739 -0.0750 -0.1346 -0.1368 0.2275 0.2737 0.0816 0.0864 0.0901 0.0701 0.0886 0.0986 0.0887 0.0791 0.1151 0.1387 0.1149 0.0662 0.0972 0.0965 0.0840 0.0879 0.0785 0.0942 0.0889 0.0932 0.0934 0.0802 0.0751 0.0794 0.0763
va: 2.1169 2.1477 2.1886 2.1944 3.0988 3.7296 3.8360 3.8414 3.9102 3.9173 3.8952 4.2212 3.7449 3.8984 3.9378 3.9496 3.5850 3.6570 3.9283 3.9228 3.8998 3.9023 4.2736 4.2728 1.0107 1.0269 1.0048 1.0072 1.0042 1.0170 1.0055 1.0014 1.0191 1.0175 1.0087 0.9949 1.0147 1.0009 0.9993 0.9989 1.0159 1.0093 1.0199 1.0085 1.0190 1.0115 1.0089 1.0118 1.0080
dispcorr: -0.025255662 hartree
energy: -1094.875049922719
dipole: 8.20944 -9.17641 -0.96697 24.03750 -23.04744 0.99006 -7.02875 6.19044 -0.83831
magnitude: 1.61803 au
magnitude: 4.11270 debye
