program: Orca
programVersion: 5.0.2
elementType: O O O O N C C C C C C C C C C C C C C C C C C C H H H H H H H H H H H H H H H H H H H H H H H H H
charge: 0
multiplicity: 1
keywords: wb97x-d3
keywords: def2-TZVPP
keywords: def2/J RIJCOSX
keywords: DEFGRID2
keywords: scfconv7
keywords: smallprint printgap noloewdin
keywords: NOSOSCF
formula: C19H25NO4
InChI: InChI=1/C19H25NO4/c1-11(2)9-14-15(19(14,3)4)18(23)24-10-20-16(21)12-7-5-6-8-13(12)17(20)22/h9,14-15H,5-8,10H2,1-4H3
49 atoms
O  1.140603 -1.35799 -0.478076
O  2.622625 -2.735685 -1.408788
O  -1.269687 -0.157547 -2.40592
O  -1.462947 -2.312016 1.594633
N  -1.129634 -1.529292 -0.553586
C  3.444889 0.08221 0.829778
C  3.190036 0.789515 -0.46488
C  3.410904 -0.71484 -0.462467
C  4.820679 0.233239 1.438813
C  2.360682 -0.05258 1.872605
C  1.89125 1.406063 -0.845587
C  2.37991 -1.709161 -0.831614
C  1.352974 2.475967 -0.259543
C  0.075841 -2.210243 -0.875414
C  0.05419 3.049151 -0.742974
C  1.975492 3.195682 0.897749
C  -2.708521 0.145109 -0.485827
C  -2.766604 -0.486178 0.686646
C  -3.55698 1.296766 -0.880142
C  -3.708072 -0.155925 1.785538
C  -4.24929 1.866408 0.359071
C  -4.811461 0.761227 1.25376
C  -1.640675 -0.477282 -1.310473
C  -1.735614 -1.558535 0.703392
H  4.050722 1.321856 -0.865612
H  4.379552 -1.040875 -0.822668
H  4.869831 1.130733 2.059412
H  5.063447 -0.621011 2.073131
H  5.599677 0.314661 0.679794
H  1.358712 0.061217 1.472148
H  2.420573 -1.020246 2.373265
H  2.498114 0.715696 2.635898
H  1.37569 0.980833 -1.699905
H  0.110871 -3.156791 -0.336319
H  0.113761 -2.404037 -1.947126
H  0.169882 4.094059 -1.042109
H  -0.342316 2.496728 -1.594079
H  -0.69735 3.036388 0.052487
H  1.319528 3.174398 1.771751
H  2.936901 2.77868 1.189659
H  2.131422 4.249484 0.653041
H  -2.951672 2.057978 -1.377868
H  -4.292552 0.97084 -1.622717
H  -4.12509 -1.068201 2.217603
H  -3.157044 0.330347 2.597111
H  -3.529822 2.462308 0.928973
H  -5.045559 2.5483 0.057357
H  -5.529324 0.165372 0.682585
H  -5.364777 1.196045 2.087284
totalener: -1094.84890401 hartree
nucrepener: 2210.76052936 hartree
electener: -3305.60943337 hartree
oneelecener: -5882.98035066 hartree
twoeener: 2577.37091729 hartree
kineticenergy: 1090.09799994 hartree
xcener: -105.972642324453 hartree
chargesum: -0.0000000
charge: -0.257626 -0.360454 -0.323329 -0.314553 -0.106352 0.053679 -0.013948 -0.073340 -0.246037 -0.251522 -0.196644 0.311623 -0.009375 0.075664 -0.239996 -0.249351 -0.050218 -0.065530 -0.102042 -0.072960 -0.124118 -0.135106 0.215420 0.239669 0.100821 0.087187 0.079611 0.097076 0.074424 0.089127 0.109723 0.079619 0.100578 0.126107 0.126590 0.097959 0.084199 0.075984 0.090055 0.082818 0.097624 0.098455 0.100887 0.094602 0.092678 0.072015 0.081281 0.076330 0.080695
qa: -0.2576 -0.3605 -0.3233 -0.3146 -0.1064 0.0537 -0.0139 -0.0733 -0.2460 -0.2515 -0.1966 0.3116 -0.0094 0.0757 -0.2400 -0.2494 -0.0502 -0.0655 -0.1020 -0.0730 -0.1241 -0.1351 0.2154 0.2397 0.1008 0.0872 0.0796 0.0971 0.0744 0.0891 0.1097 0.0796 0.1006 0.1261 0.1266 0.0980 0.0842 0.0760 0.0901 0.0828 0.0976 0.0985 0.1009 0.0946 0.0927 0.0720 0.0813 0.0763 0.0807
va: 2.0846 2.1481 2.1771 2.1941 3.1200 3.7165 3.8058 3.8434 3.9184 3.8957 3.8825 4.2433 3.6733 3.9202 3.9415 3.9438 3.5867 3.6347 3.9312 3.9201 3.8860 3.8969 4.2528 4.2584 1.0053 1.0270 1.0063 1.0030 1.0089 1.0105 1.0067 1.0006 1.0268 1.0039 1.0034 1.0023 1.0158 0.9934 0.9976 1.0093 1.0038 1.0146 1.0097 1.0181 1.0092 1.0120 1.0127 1.0088 1.0119
dispcorr: -0.028184809 hartree
energy: -1094.877088818163
dipole: 3.06429 -4.24663 -1.18234 23.57240 -21.98386 1.58853 11.88933 -11.01867 0.87066
magnitude: 2.16319 au
magnitude: 5.49840 debye
