program: Orca
programVersion: 5.0.2
elementType: O O O O N C C C C C C C C C C C C C C C C C C C H H H H H H H H H H H H H H H H H H H H H H H H H
charge: 0
multiplicity: 1
keywords: wb97x-d3
keywords: def2-TZVPP
keywords: def2/J RIJCOSX
keywords: DEFGRID2
keywords: scfconv7
keywords: smallprint printgap noloewdin
keywords: NOSOSCF
formula: C19H25NO4
InChI: InChI=1/C19H25NO4/c1-11(2)9-14-15(19(14,3)4)18(23)24-10-20-16(21)12-7-5-6-8-13(12)17(20)22/h9,14-15H,5-8,10H2,1-4H3
49 atoms
O  0.477496 -0.246205 0.00381
O  2.267145 -0.887096 1.1734
O  -1.54418 -2.750758 -1.191751
O  -2.466188 0.837672 1.452006
N  -1.660541 -1.009066 0.321646
C  3.89427 0.320549 -1.200741
C  3.735121 1.417974 -0.205975
C  2.50804 0.632831 -0.670306
C  4.125988 0.720571 -2.639752
C  4.597701 -0.961859 -0.829833
C  4.257056 1.327508 1.179541
C  1.792987 -0.247881 0.272441
C  3.799985 2.034541 2.212576
C  -0.338239 -1.055194 0.839268
C  4.412253 1.912495 3.574228
C  2.636721 2.97306 2.118872
C  -3.501034 -1.339187 -1.020714
C  -3.772471 -0.290099 -0.245107
C  -4.416669 -1.904712 -2.043029
C  -5.044938 0.473796 -0.257528
C  -5.544428 -0.908995 -2.322595
C  -6.10614 -0.310371 -1.032578
C  -2.135431 -1.832282 -0.697866
C  -2.598586 -0.025898 0.63074
H  3.758152 2.42045 -0.62611
H  1.85344 1.150405 -1.361896
H  5.191398 0.860811 -2.831283
H  3.762725 -0.048734 -3.323347
H  3.620573 1.653832 -2.892038
H  4.24964 -1.780266 -1.462039
H  5.670703 -0.852254 -0.998954
H  4.446368 -1.259594 0.203314
H  5.085171 0.647485 1.348264
H  -0.339155 -0.674351 1.860888
H  0.011107 -2.087687 0.842164
H  4.783491 2.877472 3.928432
H  3.673105 1.574467 4.304523
H  5.24181 1.207009 3.588344
H  1.824023 2.637454 2.767953
H  2.911723 3.974316 2.459261
H  2.234879 3.058901 1.111483
H  -3.865368 -2.144283 -2.954994
H  -4.819991 -2.856703 -1.682749
H  -5.37413 0.679448 0.763479
H  -4.87352 1.453563 -0.715082
H  -5.162867 -0.10474 -2.958369
H  -6.339422 -1.39891 -2.886606
H  -6.490583 -1.115674 -0.399846
H  -6.954168 0.338121 -1.257082
totalener: -1094.85257303 hartree
nucrepener: 2072.68157826 hartree
electener: -3167.53415130 hartree
oneelecener: -5607.40907783 hartree
twoeener: 2439.87492653 hartree
kineticenergy: 1090.09594380 hartree
xcener: -105.970951817554 hartree
chargesum: 0.0000000
charge: -0.268719 -0.379476 -0.316415 -0.318369 -0.127619 0.129701 -0.065563 -0.079530 -0.240892 -0.283314 -0.159245 0.331453 -0.009884 0.093859 -0.211458 -0.253598 -0.085753 -0.093115 -0.074692 -0.074029 -0.135741 -0.135742 0.260099 0.265551 0.094463 0.079951 0.087129 0.091905 0.069883 0.089283 0.088687 0.105114 0.082046 0.122482 0.120985 0.082331 0.086762 0.077578 0.094822 0.091715 0.081629 0.094591 0.092243 0.093944 0.093396 0.075931 0.079923 0.075483 0.080217
qa: -0.2687 -0.3795 -0.3164 -0.3184 -0.1276 0.1297 -0.0656 -0.0795 -0.2409 -0.2833 -0.1592 0.3315 -0.0099 0.0939 -0.2115 -0.2536 -0.0858 -0.0931 -0.0747 -0.0740 -0.1357 -0.1357 0.2601 0.2656 0.0945 0.0800 0.0871 0.0919 0.0699 0.0893 0.0887 0.1051 0.0820 0.1225 0.1210 0.0823 0.0868 0.0776 0.0948 0.0917 0.0816 0.0946 0.0922 0.0939 0.0934 0.0759 0.0799 0.0755 0.0802
va: 2.1068 2.1030 2.1985 2.1970 3.1181 3.7492 3.8987 3.8351 3.9030 3.9123 3.8807 4.1563 3.7674 3.9072 3.9427 3.9472 3.6214 3.6288 3.9257 3.9265 3.8989 3.8976 4.2779 4.2749 1.0048 1.0302 1.0047 1.0048 1.0076 1.0043 0.9978 1.0184 1.0114 1.0021 1.0052 0.9980 0.9993 1.0113 0.9997 1.0012 1.0089 1.0192 1.0081 1.0188 1.0084 1.0087 1.0116 1.0088 1.0116
dispcorr: -0.022735497 hartree
energy: -1094.875308529294
dipole: 13.31640 -14.54154 -1.22514 10.75685 -10.27144 0.48541 -2.68486 1.82204 -0.86282
magnitude: 1.57513 au
magnitude: 4.00367 debye
