program: Orca
programVersion: 5.0.2
elementType: O O O O N C C C C C C C C C C C C C C C C C C C H H H H H H H H H H H H H H H H H H H H H H H H H
charge: 0
multiplicity: 1
keywords: wb97x-d3
keywords: def2-TZVPP
keywords: def2/J RIJCOSX
keywords: DEFGRID2
keywords: scfconv7
keywords: smallprint printgap noloewdin
keywords: NOSOSCF
formula: C19H25NO4
InChI: InChI=1/C19H25NO4/c1-11(2)9-14-15(19(14,3)4)18(23)24-10-20-16(21)12-7-5-6-8-13(12)17(20)22/h9,14-15H,5-8,10H2,1-4H3
49 atoms
O  0.432069 -0.258981 0.054643
O  2.241003 -0.867307 1.213575
O  -1.514242 -2.797994 -1.167375
O  -2.545102 0.755717 1.483503
N  -1.688283 -1.071299 0.358312
C  3.803097 0.317012 -1.22422
C  3.700137 1.407041 -0.213728
C  2.443159 0.647412 -0.637997
C  3.988665 0.728194 -2.666704
C  4.497703 -0.980712 -0.891858
C  4.277909 1.298801 1.147262
C  1.748228 -0.239087 0.314771
C  3.930304 2.060138 2.184449
C  -0.369376 -1.086859 0.886424
C  4.604297 1.91877 3.514839
C  2.840916 3.086078 2.12597
C  -3.4949 -1.416985 -1.026231
C  -3.798712 -0.379117 -0.247563
C  -4.378709 -1.984463 -2.075222
C  -5.08114 0.367147 -0.281625
C  -5.511149 -0.999458 -2.372886
C  -6.112429 -0.422053 -1.091137
C  -2.129438 -1.89291 -0.677947
C  -2.647632 -0.10448 0.654553
H  3.723415 2.411971 -0.627363
H  1.773157 1.18257 -1.300916
H  3.487586 1.670775 -2.891431
H  5.048427 0.855915 -2.894739
H  3.59043 -0.029078 -3.344208
H  4.123694 -1.783488 -1.529481
H  5.567878 -0.882461 -1.084612
H  4.367104 -1.294339 0.139606
H  5.059695 0.561327 1.292741
H  -0.386393 -0.705119 1.907487
H  0.004783 -2.110566 0.892245
H  3.886074 1.633703 4.287553
H  5.390232 1.164925 3.496144
H  5.050658 2.86356 3.835391
H  2.071107 2.866524 2.870078
H  3.225078 4.081756 2.361981
H  2.350727 3.135406 1.155694
H  -3.802523 -2.208599 -2.975632
H  -4.779129 -2.944497 -1.733669
H  -5.437576 0.555682 0.73355
H  -4.912429 1.354828 -0.72289
H  -5.123094 -0.183681 -2.98982
H  -6.285568 -1.492353 -2.962314
H  -6.501696 -1.239089 -0.476689
H  -6.963113 0.217855 -1.329729
totalener: -1094.85255138 hartree
nucrepener: 2068.55672134 hartree
electener: -3163.40927272 hartree
oneelecener: -5599.14957651 hartree
twoeener: 2435.74030378 hartree
kineticenergy: 1090.09330222 hartree
xcener: -105.970308048746 hartree
chargesum: -0.0000000
charge: -0.268163 -0.380350 -0.316364 -0.317662 -0.129417 0.130074 -0.066128 -0.077107 -0.240030 -0.285709 -0.151870 0.332268 -0.014277 0.094634 -0.211699 -0.252581 -0.084158 -0.093258 -0.075104 -0.073912 -0.135865 -0.135672 0.259490 0.265151 0.093773 0.079099 0.069694 0.087431 0.091845 0.089972 0.090130 0.104386 0.081448 0.123027 0.121003 0.087114 0.077475 0.081667 0.091871 0.092002 0.079653 0.094469 0.092246 0.094114 0.093489 0.075987 0.080088 0.075576 0.080149
qa: -0.2682 -0.3803 -0.3164 -0.3177 -0.1294 0.1301 -0.0661 -0.0771 -0.2400 -0.2857 -0.1519 0.3323 -0.0143 0.0946 -0.2117 -0.2526 -0.0842 -0.0933 -0.0751 -0.0739 -0.1359 -0.1357 0.2595 0.2652 0.0938 0.0791 0.0697 0.0874 0.0918 0.0900 0.0901 0.1044 0.0814 0.1230 0.1210 0.0871 0.0775 0.0817 0.0919 0.0920 0.0797 0.0945 0.0922 0.0941 0.0935 0.0760 0.0801 0.0756 0.0801
va: 2.1101 2.1032 2.1984 2.1975 3.1196 3.7571 3.8902 3.8429 3.9014 3.9136 3.8805 4.1590 3.7699 3.9061 3.9431 3.9484 3.6193 3.6296 3.9258 3.9266 3.8989 3.8976 4.2784 4.2759 1.0042 1.0300 1.0077 1.0046 1.0049 1.0041 0.9979 1.0185 1.0114 1.0025 1.0050 0.9992 1.0115 0.9977 0.9998 1.0005 1.0092 1.0192 1.0081 1.0188 1.0085 1.0088 1.0116 1.0088 1.0116
dispcorr: -0.022545541 hartree
energy: -1094.875096918176
dipole: 13.84361 -15.05542 -1.21181 11.02053 -10.55173 0.46880 -3.30359 2.39413 -0.90947
magnitude: 1.58599 au
magnitude: 4.03128 debye
