program: Orca
programVersion: 5.0.2
elementType: O O O O N C C C C C C C C C C C C C C C C C C C H H H H H H H H H H H H H H H H H H H H H H H H H
charge: 0
multiplicity: 1
keywords: wb97x-d3
keywords: def2-TZVPP
keywords: def2/J RIJCOSX
keywords: DEFGRID2
keywords: scfconv7
keywords: smallprint printgap noloewdin
keywords: NOSOSCF
formula: C19H25NO4
InChI: InChI=1/C19H25NO4/c1-11(2)9-14-15(19(14,3)4)18(23)24-10-20-16(21)12-7-5-6-8-13(12)17(20)22/h9,14-15H,5-8,10H2,1-4H3
49 atoms
O  0.559025 -0.768981 -0.121422
O  2.151075 -1.167354 1.390891
O  -2.028632 -2.753748 -1.38598
O  -1.974954 0.766767 1.497968
N  -1.676188 -1.142524 0.233049
C  4.121578 0.117576 -0.635758
C  3.519769 1.293727 0.064111
C  2.615119 0.204405 -0.528542
C  4.668284 0.367564 -2.023228
C  4.915554 -0.923477 0.115061
C  3.622815 1.517282 1.517542
C  1.804059 -0.648379 0.362655
C  3.38823 2.669678 2.150779
C  -0.371535 -1.495315 0.670033
C  3.537571 2.7653 3.639896
C  2.949403 3.943819 1.493907
C  -3.605413 -0.957154 -1.008152
C  -3.59374 0.068831 -0.157894
C  -4.678941 -1.234049 -1.995127
C  -4.660402 1.093384 -0.038113
C  -5.57927 -0.003734 -2.130237
C  -5.914327 0.611313 -0.770596
C  -2.371507 -1.763927 -0.802617
C  -2.347255 0.006284 0.649582
H  3.495172 2.200955 -0.529106
H  2.097657 0.490385 -1.436882
H  5.709597 0.691634 -1.971674
H  4.630723 -0.541129 -2.627232
H  4.108579 1.140361 -2.552582
H  5.948151 -0.585585 0.219503
H  4.531009 -1.146388 1.104449
H  4.930678 -1.859868 -0.445217
H  3.912294 0.668335 2.123777
H  -0.26279 -1.245154 1.724697
H  -0.227186 -2.567763 0.536989
H  3.846365 1.819487 4.082615
H  4.274867 3.523839 3.915755
H  2.595476 3.061713 4.108119
H  1.985942 4.265511 1.896951
H  3.657202 4.750319 1.701184
H  2.838758 3.869946 0.41456
H  -4.245969 -1.514084 -2.958069
H  -5.257109 -2.104121 -1.667105
H  -4.871192 1.29981 1.01367
H  -4.302625 2.039157 -0.458182
H  -5.075531 0.74396 -2.749769
H  -6.496288 -0.273493 -2.656004
H  -6.425696 -0.13338 -0.153666
H  -6.611512 1.441125 -0.895335
totalener: -1094.85333002 hartree
nucrepener: 2062.71310400 hartree
electener: -3157.56643403 hartree
oneelecener: -5587.42134564 hartree
twoeener: 2429.85491162 hartree
kineticenergy: 1090.09074677 hartree
xcener: -105.971300530211 hartree
chargesum: -0.0000000
charge: -0.267098 -0.395760 -0.317590 -0.315573 -0.126706 0.106400 0.003510 -0.069156 -0.237281 -0.267655 -0.199403 0.350325 -0.039853 0.091028 -0.208107 -0.244561 -0.093773 -0.084396 -0.074137 -0.075328 -0.136078 -0.134119 0.263834 0.260255 0.080264 0.078055 0.088530 0.090204 0.068991 0.088548 0.105317 0.084865 0.097645 0.123739 0.121385 0.080261 0.080525 0.085728 0.090080 0.085173 0.076821 0.094835 0.092695 0.093755 0.092635 0.075803 0.080126 0.075225 0.080018
qa: -0.2671 -0.3958 -0.3176 -0.3156 -0.1267 0.1064 0.0035 -0.0692 -0.2373 -0.2677 -0.1994 0.3503 -0.0399 0.0910 -0.2081 -0.2446 -0.0938 -0.0844 -0.0741 -0.0753 -0.1361 -0.1341 0.2638 0.2603 0.0803 0.0781 0.0885 0.0902 0.0690 0.0885 0.1053 0.0849 0.0976 0.1237 0.1214 0.0803 0.0805 0.0857 0.0901 0.0852 0.0768 0.0948 0.0927 0.0938 0.0926 0.0758 0.0801 0.0752 0.0800
va: 2.1153 2.0910 2.1967 2.1979 3.1159 3.7545 3.8128 3.8618 3.9017 3.9117 3.9196 4.1550 3.8205 3.9011 3.9390 3.9471 3.6396 3.6178 3.9252 3.9281 3.8993 3.8970 4.2789 4.2788 1.0109 1.0298 1.0045 1.0050 1.0080 0.9997 1.0221 1.0025 1.0222 1.0078 1.0028 1.0128 0.9972 0.9988 0.9994 0.9984 1.0144 1.0189 1.0080 1.0190 1.0086 1.0087 1.0116 1.0088 1.0118
dispcorr: -0.021859445 hartree
energy: -1094.875189469082
dipole: 14.19930 -15.33684 -1.13754 16.38326 -15.55358 0.82968 -0.75789 -0.08304 -0.84093
magnitude: 1.63998 au
magnitude: 4.16850 debye
