program: Orca
programVersion: 5.0.2
elementType: O O O O N C C C C C C C C C C C C C C C C C C C H H H H H H H H H H H H H H H H H H H H H H H H H
charge: 0
multiplicity: 1
keywords: wb97x-d3
keywords: def2-TZVPP
keywords: def2/J RIJCOSX
keywords: DEFGRID2
keywords: scfconv7
keywords: smallprint printgap noloewdin
keywords: NOSOSCF
formula: C19H25NO4
InChI: InChI=1/C19H25NO4/c1-11(2)9-14-15(19(14,3)4)18(23)24-10-20-16(21)12-7-5-6-8-13(12)17(20)22/h9,14-15H,5-8,10H2,1-4H3
49 atoms
O  0.651992 -1.469847 0.320491
O  1.989613 -0.466612 1.812375
O  -1.546829 0.826803 1.472208
O  -2.271149 -3.347185 -0.186542
N  -1.598549 -1.39669 0.85313
C  4.012538 -0.188008 -0.523679
C  3.110971 0.988444 -0.737425
C  2.5144 -0.404985 -0.53231
C  4.739247 -0.721476 -1.736533
C  4.8245 -0.298714 0.742975
C  2.946734 2.073572 0.250262
C  1.734542 -0.751137 0.6737
C  3.136034 3.373855 0.012657
C  -0.309796 -1.789868 1.313086
C  2.908138 4.385776 1.096011
C  3.578335 3.956709 -1.295873
C  -3.364414 -0.08998 0.163442
C  -3.57262 -1.311443 -0.327777
C  -4.270103 1.071724 -0.018976
C  -4.73703 -1.708257 -1.15878
C  -5.619032 0.590058 -0.557103
C  -5.451456 -0.452829 -1.663368
C  -2.080775 -0.090077 0.914965
C  -2.44238 -2.190161 0.078732
H  3.028747 1.307346 -1.77101
H  2.117654 -0.857262 -1.433625
H  4.141601 -0.633538 -2.644919
H  5.669075 -0.17313 -1.898577
H  4.992539 -1.775381 -1.608149
H  4.337646 0.127069 1.613904
H  5.049064 -1.343269 0.965045
H  5.773884 0.221483 0.604348
H  2.641033 1.788622 1.249169
H  -0.085554 -1.286388 2.251835
H  -0.309582 -2.868507 1.462726
H  3.816365 4.957652 1.301542
H  2.144325 5.110085 0.800782
H  2.584149 3.922043 2.026237
H  4.493786 4.537898 -1.162111
H  3.777516 3.213133 -2.064265
H  2.827825 4.649052 -1.685761
H  -4.390771 1.610971 0.923339
H  -3.80702 1.78467 -0.708945
H  -4.412967 -2.33973 -1.988938
H  -5.415197 -2.327438 -0.562588
H  -6.199012 0.156447 0.262815
H  -6.194382 1.440351 -0.926149
H  -4.874176 -0.018204 -2.484711
H  -6.424576 -0.721897 -2.076795
totalener: -1094.85248658 hartree
nucrepener: 2076.59322069 hartree
electener: -3171.44570726 hartree
oneelecener: -5615.25250937 hartree
twoeener: 2443.80680210 hartree
kineticenergy: 1090.09007286 hartree
xcener: -105.971642737862 hartree
chargesum: -0.0000000
charge: -0.273553 -0.388972 -0.309957 -0.319689 -0.116812 0.118604 0.009976 -0.123980 -0.241427 -0.251238 -0.219074 0.374152 -0.037024 0.071294 -0.207251 -0.245083 -0.078189 -0.093986 -0.073830 -0.076209 -0.136305 -0.134217 0.249747 0.265254 0.084244 0.084360 0.070373 0.087713 0.089314 0.105616 0.086832 0.081968 0.115661 0.139463 0.112349 0.080251 0.081166 0.084340 0.085048 0.076154 0.087560 0.093912 0.094160 0.094939 0.091270 0.075425 0.080392 0.075608 0.079650
qa: -0.2736 -0.3890 -0.3100 -0.3197 -0.1168 0.1186 0.0100 -0.1240 -0.2414 -0.2512 -0.2191 0.3742 -0.0370 0.0713 -0.2073 -0.2451 -0.0782 -0.0940 -0.0738 -0.0762 -0.1363 -0.1342 0.2497 0.2653 0.0842 0.0844 0.0704 0.0877 0.0893 0.1056 0.0868 0.0820 0.1157 0.1395 0.1123 0.0803 0.0812 0.0843 0.0850 0.0762 0.0876 0.0939 0.0942 0.0949 0.0913 0.0754 0.0804 0.0756 0.0796
va: 2.1166 2.1030 2.2014 2.1942 3.0914 3.7164 3.8188 3.9219 3.9087 3.9187 3.9082 4.1279 3.7897 3.8925 3.9413 3.9471 3.6077 3.6425 3.9280 3.9247 3.8969 3.8985 4.2901 4.2832 1.0106 1.0293 1.0079 1.0042 1.0052 1.0195 1.0030 1.0027 1.0249 1.0168 1.0067 0.9980 0.9980 1.0128 0.9999 1.0140 0.9983 1.0189 1.0086 1.0191 1.0081 1.0086 1.0117 1.0088 1.0117
dispcorr: -0.022236993 hartree
energy: -1094.874723570180
dipole: 14.72935 -15.73332 -1.00397 18.63360 -18.16328 0.47032 -10.13679 9.06133 -1.07546
magnitude: 1.54459 au
magnitude: 3.92605 debye
