program: Orca
programVersion: 5.0.2
elementType: O O O O N C C C C C C C C C C C C C C C C C C C H H H H H H H H H H H H H H H H H H H H H H H H H
charge: 0
multiplicity: 1
keywords: wb97x-d3
keywords: def2-TZVPP
keywords: def2/J RIJCOSX
keywords: DEFGRID2
keywords: scfconv7
keywords: smallprint printgap noloewdin
keywords: NOSOSCF
formula: C19H25NO4
InChI: InChI=1/C19H25NO4/c1-11(2)9-14-15(19(14,3)4)18(23)24-10-20-16(21)12-7-5-6-8-13(12)17(20)22/h9,14-15H,5-8,10H2,1-4H3
49 atoms
O  0.630204 -1.430383 0.338044
O  1.967872 -0.410552 1.818332
O  -1.615068 0.843792 1.469145
O  -2.245172 -3.352836 -0.16984
N  -1.62089 -1.384187 0.8655
C  3.995649 -0.19743 -0.524939
C  3.122978 1.000728 -0.736932
C  2.492123 -0.375849 -0.527107
C  4.703743 -0.752739 -1.738864
C  4.807877 -0.326611 0.739522
C  2.994117 2.093082 0.248406
C  1.712022 -0.707367 0.682816
C  3.236085 3.384221 0.00853
C  -0.327712 -1.747707 1.33595
C  3.044071 4.408344 1.087484
C  3.707956 3.944801 -1.299372
C  -3.402809 -0.114448 0.148005
C  -3.582593 -1.342518 -0.338145
C  -4.3279 1.028944 -0.05196
C  -4.729023 -1.765675 -1.18118
C  -5.660957 0.519875 -0.604498
C  -5.460177 -0.526553 -1.701983
C  -2.127487 -0.085941 0.912981
C  -2.440815 -2.197688 0.086081
H  3.044222 1.319263 -1.770936
H  2.081878 -0.820505 -1.426153
H  4.106432 -0.648695 -2.645861
H  5.648339 -0.231038 -1.9039
H  4.92734 -1.813354 -1.610028
H  4.335002 0.114186 1.610812
H  5.0055 -1.376276 0.963352
H  5.770288 0.168035 0.59716
H  2.672296 1.821865 1.24603
H  -0.114018 -1.221883 2.264852
H  -0.30925 -2.823001 1.507167
H  2.312319 5.162557 0.785891
H  2.69703 3.961649 2.018004
H  3.974358 4.943154 1.295546
H  2.984675 4.660499 -1.698876
H  4.641851 4.495266 -1.161553
H  3.887699 3.190818 -2.062636
H  -4.470729 1.570339 0.886067
H  -3.869614 1.747326 -0.739576
H  -4.382363 -2.395658 -2.003341
H  -5.40304 -2.394181 -0.590035
H  -6.243479 0.08052 0.210563
H  -6.246804 1.357418 -0.98599
H  -4.88124 -0.086138 -2.519096
H  -6.423084 -0.816103 -2.125391
totalener: -1094.85254966 hartree
nucrepener: 2073.42771345 hartree
electener: -3168.28026310 hartree
oneelecener: -5608.91124780 hartree
twoeener: 2440.63098469 hartree
kineticenergy: 1090.08821775 hartree
xcener: -105.971212191849 hartree
chargesum: 0.0000000
charge: -0.273198 -0.389935 -0.309957 -0.319272 -0.118060 0.119762 0.007778 -0.125038 -0.241630 -0.251445 -0.220237 0.374795 -0.033875 0.072916 -0.208092 -0.245470 -0.078648 -0.093141 -0.073984 -0.076172 -0.136486 -0.134236 0.249831 0.264760 0.084384 0.084206 0.070401 0.087654 0.089383 0.105590 0.087000 0.082172 0.116421 0.138903 0.112457 0.081145 0.084130 0.080433 0.087869 0.084795 0.076271 0.093921 0.094240 0.095067 0.091277 0.075440 0.080574 0.075733 0.079566
qa: -0.2732 -0.3899 -0.3100 -0.3193 -0.1181 0.1198 0.0078 -0.1250 -0.2416 -0.2514 -0.2202 0.3748 -0.0339 0.0729 -0.2081 -0.2455 -0.0786 -0.0931 -0.0740 -0.0762 -0.1365 -0.1342 0.2498 0.2648 0.0844 0.0842 0.0704 0.0877 0.0894 0.1056 0.0870 0.0822 0.1164 0.1389 0.1125 0.0811 0.0841 0.0804 0.0879 0.0848 0.0763 0.0939 0.0942 0.0951 0.0913 0.0754 0.0806 0.0757 0.0796
va: 2.1170 2.1015 2.2014 2.1945 3.0931 3.7161 3.8188 3.9266 3.9089 3.9195 3.9088 4.1269 3.7839 3.8927 3.9415 3.9473 3.6083 3.6408 3.9278 3.9244 3.8967 3.8982 4.2899 4.2835 1.0105 1.0293 1.0079 1.0042 1.0052 1.0193 1.0028 1.0028 1.0249 1.0170 1.0060 0.9979 1.0127 0.9981 0.9983 0.9999 1.0137 1.0188 1.0086 1.0191 1.0081 1.0085 1.0117 1.0088 1.0117
dispcorr: -0.022199090 hartree
energy: -1094.874748745121
dipole: 15.16472 -16.16205 -0.99733 18.22794 -17.79777 0.43017 -10.32616 9.23325 -1.09291
magnitude: 1.54083 au
magnitude: 3.91647 debye
