program: Orca
programVersion: 5.0.2
elementType: O O O O N C C C C C C C C C C C C C C C C C C C H H H H H H H H H H H H H H H H H H H H H H H H H
charge: 0
multiplicity: 1
keywords: wb97x-d3
keywords: def2-TZVPP
keywords: def2/J RIJCOSX
keywords: DEFGRID2
keywords: scfconv7
keywords: smallprint printgap noloewdin
keywords: NOSOSCF
formula: C19H25NO4
InChI: InChI=1/C19H25NO4/c1-11(2)9-14-15(19(14,3)4)18(23)24-10-20-16(21)12-7-5-6-8-13(12)17(20)22/h9,14-15H,5-8,10H2,1-4H3
49 atoms
O  0.371996 -0.731749 0.096925
O  1.874229 -0.443187 -1.536913
O  -2.013866 0.672445 -1.753212
O  -2.300768 -2.865836 1.093968
N  -1.807569 -1.23244 -0.465167
C  2.598181 2.105029 0.164871
C  3.591639 1.056309 0.561838
C  2.102773 0.723846 0.5534
C  2.311771 3.196135 1.170378
C  2.516678 2.588769 -1.261904
C  4.561079 0.4676 -0.379946
C  1.485876 -0.192005 -0.427713
C  5.848338 0.21474 -0.125679
C  -0.444983 -1.537861 -0.739032
C  6.731442 -0.36734 -1.190564
C  6.547606 0.466473 1.176441
C  -3.801243 -0.091448 -0.311775
C  -3.883913 -1.127164 0.5228
C  -4.870985 0.91194 -0.538256
C  -5.071021 -1.464901 1.347439
C  -5.930778 0.785831 0.558152
C  -6.28177 -0.674468 0.846179
C  -2.463574 -0.10748 -0.961518
C  -2.603546 -1.884772 0.474468
H  3.962871 1.166779 1.574556
H  1.64388 0.663792 1.533369
H  2.388201 2.837963 2.198158
H  3.019846 4.01885 1.054138
H  1.306759 3.599922 1.033644
H  2.723644 1.820863 -2.000622
H  1.521577 2.985026 -1.471639
H  3.234454 3.396992 -1.412418
H  4.194119 0.225965 -1.368663
H  -0.271035 -2.589016 -0.51091
H  -0.229253 -1.352199 -1.78992
H  6.189172 -0.550019 -2.1176
H  7.568044 0.299668 -1.416505
H  7.168399 -1.315372 -0.865113
H  6.979056 -0.459014 1.565982
H  7.380518 1.160494 1.036062
H  5.907333 0.880817 1.951994
H  -4.446768 1.918209 -0.564483
H  -5.313556 0.752629 -1.526996
H  -5.261184 -2.540059 1.317031
H  -4.861589 -1.231944 2.396554
H  -5.557818 1.255019 1.473185
H  -6.826923 1.337566 0.270501
H  -6.661662 -1.140901 -0.067486
H  -7.087974 -0.728919 1.579179
totalener: -1094.85323222 hartree
nucrepener: 2052.05549119 hartree
electener: -3146.90872341 hartree
oneelecener: -5566.07108569 hartree
twoeener: 2419.16236228 hartree
kineticenergy: 1090.08032354 hartree
xcener: -105.970373973849 hartree
chargesum: 0.0000000
charge: -0.271297 -0.392546 -0.316854 -0.318484 -0.116766 0.086503 0.035459 -0.094295 -0.241583 -0.257063 -0.208394 0.369958 -0.061257 0.076526 -0.204477 -0.242400 -0.073934 -0.099324 -0.074342 -0.076131 -0.136359 -0.133455 0.250635 0.268892 0.086261 0.081880 0.069112 0.088975 0.089436 0.099612 0.094161 0.087048 0.106963 0.114947 0.134311 0.081568 0.081105 0.081342 0.086569 0.086068 0.076071 0.094077 0.092992 0.094505 0.093038 0.075658 0.080452 0.074932 0.079905
qa: -0.2713 -0.3925 -0.3169 -0.3185 -0.1168 0.0865 0.0355 -0.0943 -0.2416 -0.2571 -0.2084 0.3700 -0.0613 0.0765 -0.2045 -0.2424 -0.0739 -0.0993 -0.0743 -0.0761 -0.1364 -0.1335 0.2506 0.2689 0.0863 0.0819 0.0691 0.0890 0.0894 0.0996 0.0942 0.0870 0.1070 0.1149 0.1343 0.0816 0.0811 0.0813 0.0866 0.0861 0.0761 0.0941 0.0930 0.0945 0.0930 0.0757 0.0805 0.0749 0.0799
va: 2.1126 2.0976 2.1941 2.1955 3.0968 3.7534 3.7754 3.8832 3.9102 3.9254 3.9009 4.1412 3.8198 3.8926 3.9378 3.9448 3.6141 3.6478 3.9256 3.9265 3.8994 3.8960 4.2843 4.2780 1.0090 1.0300 1.0085 1.0039 1.0049 1.0195 1.0025 1.0011 1.0290 1.0065 1.0136 1.0128 0.9975 0.9986 0.9991 0.9989 1.0172 1.0192 1.0082 1.0191 1.0085 1.0088 1.0117 1.0087 1.0118
dispcorr: -0.021952436 hartree
energy: -1094.875184659984
dipole: 17.77596 -18.96302 -1.18706 14.89624 -14.25760 0.63864 4.94080 -4.13491 0.80589
magnitude: 1.57048 au
magnitude: 3.99185 debye
