program: Orca
programVersion: 5.0.2
elementType: O O O O N C C C C C C C C C C C C C C C C C C C H H H H H H H H H H H H H H H H H H H H H H H H H
charge: 0
multiplicity: 1
keywords: wb97x-d3
keywords: def2-TZVPP
keywords: def2/J RIJCOSX
keywords: DEFGRID2
keywords: scfconv7
keywords: smallprint printgap noloewdin
keywords: NOSOSCF
formula: C19H25NO4
InChI: InChI=1/C19H25NO4/c1-11(2)9-14-15(19(14,3)4)18(23)24-10-20-16(21)12-7-5-6-8-13(12)17(20)22/h9,14-15H,5-8,10H2,1-4H3
49 atoms
O  1.19255 -1.128996 -0.428572
O  2.725464 -2.226359 -1.614604
O  -1.366125 0.142738 -2.382467
O  -1.310977 -2.31504 1.443939
N  -1.070027 -1.334626 -0.631919
C  3.551102 -0.200868 1.314701
C  3.20984 0.89804 0.365967
C  3.457292 -0.50755 -0.169675
C  4.951457 -0.22618 1.883093
C  2.519118 -0.711954 2.290717
C  1.893284 1.585346 0.383298
C  2.446994 -1.376344 -0.809551
C  1.304003 2.156663 -0.666501
C  0.167871 -1.915506 -1.018336
C  0.033127 2.93759 -0.518193
C  1.843124 2.073808 -2.060463
C  -2.771352 0.201309 -0.4134
C  -2.765268 -0.528519 0.702122
C  -3.714229 1.31166 -0.699605
C  -3.715351 -0.372662 1.831702
C  -4.425398 1.720637 0.591935
C  -4.889977 0.505777 1.395836
C  -1.677688 -0.276082 -1.301667
C  -1.655445 -1.51484 0.620454
H  4.037311 1.56406 0.130202
H  4.41597 -0.64792 -0.655712
H  5.687094 0.157305 1.175048
H  5.010816 0.387005 2.784387
H  5.24749 -1.241655 2.151568
H  2.565831 -0.125391 3.21074
H  1.499215 -0.665136 1.921591
H  2.72499 -1.749927 2.557166
H  1.41548 1.678717 1.354203
H  0.217432 -2.943284 -0.658277
H  0.244583 -1.910383 -2.10515
H  0.197582 3.993453 -0.749154
H  -0.728356 2.584572 -1.216776
H  -0.37097 2.877367 0.492419
H  1.129953 1.559576 -2.709258
H  1.989471 3.070322 -2.484719
H  2.791201 1.542983 -2.118958
H  -3.181504 2.158358 -1.138594
H  -4.436428 0.99116 -1.457424
H  -4.059874 -1.350919 2.174404
H  -3.192927 0.071327 2.685256
H  -3.742096 2.318028 1.202692
H  -5.274774 2.364117 0.358354
H  -5.576431 -0.089064 0.78636
H  -5.455086 0.828428 2.271407
totalener: -1094.84935900 hartree
nucrepener: 2216.41604055 hartree
electener: -3311.26539955 hartree
oneelecener: -5894.45855756 hartree
twoeener: 2583.19315801 hartree
kineticenergy: 1090.10219688 hartree
xcener: -105.973551581335 hartree
chargesum: -0.0000000
charge: -0.250562 -0.363222 -0.325787 -0.315489 -0.093683 0.133354 -0.031921 -0.148881 -0.245916 -0.274873 -0.188410 0.347513 -0.005454 0.069324 -0.235895 -0.251630 -0.056646 -0.069930 -0.082299 -0.075309 -0.125406 -0.135767 0.206024 0.239820 0.098494 0.090954 0.071326 0.085362 0.092981 0.087050 0.089226 0.095287 0.087583 0.127123 0.127471 0.103121 0.070981 0.078417 0.102772 0.091771 0.085996 0.098253 0.097973 0.094324 0.093056 0.074426 0.080283 0.075789 0.081022
qa: -0.2506 -0.3632 -0.3258 -0.3155 -0.0937 0.1334 -0.0319 -0.1489 -0.2459 -0.2749 -0.1884 0.3475 -0.0055 0.0693 -0.2359 -0.2516 -0.0566 -0.0699 -0.0823 -0.0753 -0.1254 -0.1358 0.2060 0.2398 0.0985 0.0910 0.0713 0.0854 0.0930 0.0871 0.0892 0.0953 0.0876 0.1271 0.1275 0.1031 0.0710 0.0784 0.1028 0.0918 0.0860 0.0983 0.0980 0.0943 0.0931 0.0744 0.0803 0.0758 0.0810
va: 2.0891 2.1429 2.1731 2.1919 3.1126 3.7167 3.8118 3.8674 3.9134 3.9276 3.8633 4.1951 3.7238 3.9207 3.9323 3.9465 3.5975 3.6438 3.9208 3.9232 3.8865 3.8990 4.2498 4.2625 1.0068 1.0276 1.0088 1.0040 1.0040 0.9996 1.0091 1.0059 1.0066 1.0011 1.0072 1.0003 1.0100 1.0076 1.0064 1.0023 1.0071 1.0129 1.0095 1.0176 1.0092 1.0113 1.0121 1.0088 1.0119
dispcorr: -0.028166803 hartree
energy: -1094.877525800413
dipole: 2.60471 -3.87805 -1.27334 17.70323 -16.45927 1.24395 9.42634 -8.50240 0.92394
magnitude: 2.00561 au
magnitude: 5.09786 debye
