program: Orca
programVersion: 5.0.2
elementType: O O O O N C C C C C C C C C C C C C C C C C C C H H H H H H H H H H H H H H H H H H H H H H H H H
charge: 0
multiplicity: 1
keywords: wb97x-d3
keywords: def2-TZVPP
keywords: def2/J RIJCOSX
keywords: DEFGRID2
keywords: scfconv7
keywords: smallprint printgap noloewdin
keywords: NOSOSCF
formula: C19H25NO4
InChI: InChI=1/C19H25NO4/c1-11(2)9-14-15(19(14,3)4)18(23)24-10-20-16(21)12-7-5-6-8-13(12)17(20)22/h9,14-15H,5-8,10H2,1-4H3
49 atoms
O  -0.516164 1.688221 1.327272
O  -0.573091 1.560261 -0.905133
O  2.386751 2.265455 -1.173948
O  1.651996 -0.192881 2.582057
N  1.776269 1.316369 0.845807
C  -3.633241 1.123413 -0.512695
C  -3.001717 -0.232053 -0.554492
C  -2.450431 0.82656 0.392788
C  -3.488446 2.016246 -1.720328
C  -4.95694 1.308581 0.190786
C  -3.642259 -1.428091 0.02309
C  -1.111798 1.387142 0.162649
C  -3.725777 -2.639269 -0.537561
C  0.789969 2.245484 1.298284
C  -4.413142 -3.764668 0.176101
C  -3.177901 -3.002301 -1.883205
C  3.273174 0.138905 -0.448564
C  3.051415 -0.592455 0.644237
C  4.199881 -0.223232 -1.547364
C  3.658192 -1.91633 0.921219
C  5.094617 -1.377704 -1.095221
C  4.302295 -2.455607 -0.357512
C  2.45273 1.371079 -0.368856
C  2.093302 0.137072 1.508949
H  -2.381399 -0.39777 -1.42876
H  -2.702943 0.691654 1.438379
H  -4.361668 1.889664 -2.363523
H  -3.443564 3.067907 -1.43169
H  -2.610951 1.792032 -2.321865
H  -5.029092 0.742656 1.118308
H  -5.111323 2.360938 0.435853
H  -5.778501 0.996176 -0.457031
H  -4.087938 -1.298686 1.00508
H  0.991203 2.533254 2.326845
H  0.834115 3.137084 0.673983
H  -5.252484 -4.146306 -0.411017
H  -3.73198 -4.60732 0.323598
H  -4.793507 -3.46357 1.152578
H  -3.978449 -3.359032 -2.536094
H  -2.678816 -2.181797 -2.393834
H  -2.464356 -3.825901 -1.797492
H  3.621181 -0.501719 -2.433255
H  4.797128 0.644099 -1.837988
H  4.399771 -1.81924 1.719403
H  2.899385 -2.606857 1.296585
H  5.599562 -1.808819 -1.96022
H  5.87643 -0.989483 -0.436715
H  4.950836 -3.296979 -0.11233
H  3.520141 -2.8429 -1.016515
elementType: O N C H
totalener: -1094.86974780 hartree
nucrepener: 2105.59295109 hartree
electener: -3200.46269889 hartree
oneelecener: -5673.97840958 hartree
twoeener: 2473.51571069 hartree
cpcmener: -0.04088344 hartree
kineticenergy: 1090.04733298 hartree
xcener: -105.976411465371 hartree
chargesum: -0.0000000
charge: -0.288917 -0.492246 -0.431019 -0.435824 -0.103217 0.112439 0.043054 -0.120380 -0.280116 -0.271995 -0.284123 0.440137 -0.049921 0.085239 -0.218306 -0.251774 -0.067527 -0.077088 -0.073779 -0.074204 -0.135989 -0.137272 0.339578 0.334339 0.100281 0.088635 0.095648 0.100120 0.091966 0.090175 0.097981 0.097801 0.122205 0.146041 0.134702 0.094176 0.093740 0.088762 0.096906 0.089056 0.096712 0.102989 0.094182 0.101984 0.094141 0.081215 0.078671 0.081354 0.079466
qa: -0.2889 -0.4922 -0.4310 -0.4358 -0.1032 0.1124 0.0431 -0.1204 -0.2801 -0.2720 -0.2841 0.4401 -0.0499 0.0852 -0.2183 -0.2518 -0.0675 -0.0771 -0.0738 -0.0742 -0.1360 -0.1373 0.3396 0.3343 0.1003 0.0886 0.0956 0.1001 0.0920 0.0902 0.0980 0.0978 0.1222 0.1460 0.1347 0.0942 0.0937 0.0888 0.0969 0.0891 0.0967 0.1030 0.0942 0.1020 0.0941 0.0812 0.0787 0.0814 0.0795
va: 2.1127 2.0145 2.0780 2.0746 3.0880 3.6740 3.7731 3.8474 3.8998 3.9135 3.8741 4.1171 3.7604 3.8870 3.9181 3.9404 3.6643 3.7029 3.9172 3.9185 3.9153 3.9148 4.1880 4.1899 1.0264 1.0378 0.9998 0.9995 1.0202 1.0060 1.0016 1.0015 1.0099 0.9939 1.0149 0.9960 0.9963 1.0088 0.9969 1.0109 0.9967 1.0048 1.0156 1.0049 1.0150 1.0092 1.0065 1.0093 1.0066
dispcorr: -0.022601181 hartree
energy: -1094.892348981325
dipole: -19.19453 19.46651 0.27198 -17.94990 16.58153 -1.36837 -9.64780 9.75939 0.11159
magnitude: 1.39960 au
magnitude: 3.55749 debye
