program: Orca
programVersion: 5.0.2
elementType: O O O O N C C C C C C C C C C C C C C C C C C C H H H H H H H H H H H H H H H H H H H H H H H H H
charge: 0
multiplicity: 1
keywords: wb97x-d3
keywords: def2-TZVPP
keywords: def2/J RIJCOSX
keywords: DEFGRID2
keywords: scfconv7
keywords: smallprint printgap noloewdin
keywords: NOSOSCF
formula: C19H25NO4
InChI: InChI=1/C19H25NO4/c1-11(2)9-14-15(19(14,3)4)18(23)24-10-20-16(21)12-7-5-6-8-13(12)17(20)22/h9,14-15H,5-8,10H2,1-4H3
49 atoms
O  -0.516083 1.800681 1.404361
O  -0.379601 -0.423631 1.609147
O  1.499951 2.6658 -0.703278
O  2.524602 -0.297379 2.589304
N  1.806357 1.408358 1.204125
C  -2.243773 0.141314 -0.990607
C  -2.891418 -0.723319 0.057199
C  -2.240207 0.566517 0.46951
C  -0.966451 -0.333795 -1.637683
C  -3.117213 0.948717 -1.916421
C  -4.36419 -0.856905 0.166123
C  -0.972998 0.554567 1.222059
C  -5.071561 -1.94035 -0.167584
C  0.762945 1.975939 2.001066
C  -6.560713 -1.975164 -0.004688
C  -4.470984 -3.190892 -0.731081
C  2.944331 0.723608 -0.681216
C  3.231959 -0.152303 0.282375
C  3.481193 0.682592 -2.062293
C  4.126432 -1.324653 0.128563
C  4.660789 -0.289269 -2.12139
C  4.373889 -1.581611 -1.359145
C  2.008618 1.73257 -0.13269
C  2.506087 0.243717 1.51295
H  -2.323559 -1.615609 0.302733
H  -2.892724 1.403292 0.698347
H  -1.199866 -0.911927 -2.533838
H  -0.346567 0.510779 -1.947736
H  -0.367346 -0.972242 -0.989838
H  -4.017819 1.318078 -1.427324
H  -2.571988 1.810917 -2.304583
H  -3.428077 0.343011 -2.7702
H  -4.902051 0.006307 0.548092
H  0.806474 1.54175 2.999125
H  0.88595 3.052413 2.082172
H  -6.950167 -1.053699 0.427629
H  -7.055555 -2.133499 -0.966507
H  -6.865717 -2.805327 0.637494
H  -3.391174 -3.135573 -0.857393
H  -4.692593 -4.050353 -0.093121
H  -4.907963 -3.413789 -1.708009
H  2.685143 0.369476 -2.745653
H  3.780496 1.682093 -2.385282
H  5.068789 -1.131138 0.650611
H  3.689201 -2.202479 0.609279
H  4.897493 -0.512572 -3.16221
H  5.544618 0.193002 -1.694773
H  5.205499 -2.27748 -1.474733
H  3.494581 -2.068488 -1.790095
elementType: O N C H
totalener: -1094.86838227 hartree
nucrepener: 2147.15785330 hartree
electener: -3242.02623557 hartree
oneelecener: -5756.86128403 hartree
twoeener: 2514.83504846 hartree
cpcmener: -0.03992850 hartree
kineticenergy: 1090.04650089 hartree
xcener: -105.974814483392 hartree
chargesum: -0.0000000
charge: -0.277564 -0.472353 -0.433763 -0.427716 -0.104807 0.166173 -0.007520 -0.139489 -0.293856 -0.269517 -0.281606 0.409802 -0.032802 0.084781 -0.227759 -0.252527 -0.100658 -0.020696 -0.063976 -0.073170 -0.137820 -0.135186 0.326354 0.309796 0.096654 0.102320 0.105028 0.093536 0.091605 0.092189 0.099480 0.096998 0.123590 0.136003 0.145176 0.089568 0.094576 0.094487 0.088876 0.097915 0.096625 0.101815 0.094526 0.101610 0.093433 0.080984 0.078652 0.081114 0.079118
qa: -0.2776 -0.4724 -0.4338 -0.4277 -0.1048 0.1662 -0.0075 -0.1395 -0.2939 -0.2695 -0.2816 0.4098 -0.0328 0.0848 -0.2278 -0.2525 -0.1007 -0.0207 -0.0640 -0.0732 -0.1378 -0.1352 0.3264 0.3098 0.0967 0.1023 0.1050 0.0935 0.0916 0.0922 0.0995 0.0970 0.1236 0.1360 0.1452 0.0896 0.0946 0.0945 0.0889 0.0979 0.0966 0.1018 0.0945 0.1016 0.0934 0.0810 0.0787 0.0811 0.0791
va: 2.1130 2.0344 2.0668 2.0801 3.0805 3.6739 3.7977 3.8633 3.9009 3.8976 3.8673 4.2020 3.7084 3.8898 3.9248 3.9429 3.7159 3.6115 3.9124 3.9101 3.9203 3.9148 4.1581 4.1951 1.0256 1.0331 1.0025 1.0082 1.0124 1.0017 1.0031 1.0025 1.0070 1.0136 0.9929 1.0079 0.9961 0.9955 1.0082 0.9977 0.9973 1.0062 1.0159 1.0039 1.0157 1.0094 1.0061 1.0093 1.0074
dispcorr: -0.025391813 hartree
energy: -1094.893774079040
dipole: -18.40476 18.73329 0.32854 -15.41131 15.18860 -0.22270 -18.83889 17.14434 -1.69456
magnitude: 1.74042 au
magnitude: 4.42379 debye
