program: Gaussian 09
title: 000067965
version: EM64L-G09RevD.01
frameworkgroup: C1[X(C7H6FNO2)]
method: RPBEPBE
basis: SDD
operation: Freq
keyword: #p
keyword: freq=noraman
keyword: PBEPBE/SDD
title: #p freq=noraman PBEPBE/SDD
converged: YES YES YES YES
title: Mulliken charges:
elementType: F O O N C C C C C C C H H H H H H
charge: -0.193252 -0.203258 -0.196715 0.022386 0.385468 0.237913 -0.332831 -0.502540 -0.764215 -0.372620 0.363324 0.248029 0.313965 0.256333 0.214295 0.256301 0.267418
chargesum: 0.00000
title: Mulliken charges with hydrogens summed into heavy atoms:
elementType: F O O N C C C C C C C
charge: -0.193252 -0.203258 -0.196715 0.022386 0.385468 0.237913 -0.084802 -0.188575 -0.037286 -0.105203 0.363324
polarizability: 1.22319091e+02 -6.29796178e-01 1.10087773e+02 -3.56237413e-03 -4.01050567e-03 3.99258251e+01
1716.lowfreq: -9.7536 -3.4299 0.0009 0.0009 0.0010 7.3693 18.3051 120.6295 167.8971
frequency: 17.4217 120.6282 167.8969 221.6620 224.3188 319.0067 332.3199 375.8012 398.9177 434.4517 450.1431 529.1231 535.1711 664.3204 668.9294 724.4456 732.6739 758.0303 824.7013 904.8846 911.2200 955.0192 1002.9904 1041.1677 1046.6277 1145.5821 1172.5548 1202.2536 1219.9935 1264.2727 1351.2485 1372.0872 1408.2919 1411.9432 1453.4943 1469.4121 1486.2924 1585.5157 1617.3350 2997.7667 3082.9025 3099.5501 3150.7242 3181.9731 3195.7430
redmass: 9.4498 3.9470 6.4214 12.1648 1.0515 4.6072 4.3746 5.5149 8.2078 3.4389 8.1780 4.4853 3.9946 8.1111 3.8086 5.9024 6.4968 6.8268 1.3195 6.4249 1.4597 1.3365 1.4634 1.5415 2.3794 1.3061 2.2961 10.7640 7.6422 1.3933 4.3325 6.2249 1.2709 4.9240 1.0457 1.1317 3.2116 8.0884 7.1457 1.0365 1.0961 1.1014 1.0898 1.0965 1.0925
irintensity: 0.1244 0.1553 0.9041 3.3022 1.1136 0.1747 2.7422 0.1005 2.1222 1.1881 3.4519 0.2664 16.8469 6.0861 0.0680 6.9342 31.1142 10.7318 32.4796 20.1169 34.6609 0.0015 3.2969 9.5996 11.5066 9.4438 19.0695 261.0629 25.0699 10.0171 33.5035 114.1028 13.4134 4.3080 13.3754 12.0634 145.4201 2.8950 11.4436 10.6256 6.5090 25.3849 8.2132 1.6749 12.7105
temp: 298.150 k
press: 1.00000 atm
elementType: 9 8 8 7 6 6 6 6 6 6 6 1 1 1 1 1 1
symmnumber: 1
zpe: 312409.6 jmol-1
zpe.correction: 0.118991 hartree
zpe.thermalcorrener: 0.128461 hartree
zpe.thermalcorrenthalpy: 0.129405 hartree
zpe.thermalcorrgfe: 0.082999 hartree
zpe.sumelectzpe: -574.505556 hartree
zpe.sumelectthermal: -574.496086 hartree
zpe.sumelectthermalent: -574.495142 hartree
zpe.sumelectthermalfe: -574.541547 hartree
dipole: -2.1332 4.0910 0.0003
dipole: 4.6138
quadrupole: -72.4902 -60.4831 -62.9034
quadrupole: 1.1038 0.0014 0.0027
quadrupole: -7.1980 4.8091 2.3889 1.1038 0.0014 0.0027
hfenergy: -574.6245464 hartree
pointgroup: C01 [X(C7H6F1N1O2)]
dipole: -0.9228737 -1.5630848 -0.0005947 debye
dipolederiv: -0.8439252 0.4006018 0.0002874 0.4934509 -0.4803405 -0.0002294 0.0003269 -0.0002263 -0.1478571 -0.5041297 -0.1245323 -0.0000441 -0.1116445 -0.883214 0.0000939 -0.0000598 0.0000193 -0.2299881 -0.7945836 0.114112 -0.0001357 0.091431 -0.5108093 0.0000707 -0.0000725 0.0001244 -0.2080688 1.464684 0.2708728 0.00028 0.244243 1.3012877 -0.0002354 0.0001785 -0.0001619 0.1811441 0.2110173 -0.3460768 -0.0001881 0.0662196 0.1226613 0.0000494 -0.0000477 0.0000325 0.0078015 -0.4310545 -0.3368757 -0.0001349 -0.2091583 -0.0775928 0.0000827 -0.0000607 0.0000408 0.0336836 -0.1751532 0.2402435 0.0001119 0.022086 0.1244434 0.0001192 0.0000237 0.0001034 -0.150963 -0.0885412 0.3432641 0.000136 -0.1257854 -0.1656302 -0.0000256 0.0000455 -0.0000381 -0.1078282 -0.097221 0.2672109 0.0001457 0.088259 0.06759 0.0000548 0.0000077 0.0000552 0.026913 0.0092098 -0.0054228 -0.0000137 0.2045344 0.0205459 0.0000257 0.0000736 0.0000694 -0.1144198 0.8923369 -0.6352558 -0.0004038 -0.6763211 0.3848977 0.00025 -0.0004096 0.000247 0.0908592 0.0809455 0.0090759 0.0000187 -0.0274759 -0.0804442 -0.0001059 -0.0000036 -0.0001185 0.1506813 0.1534465 -0.0210166 0.0000014 0.0269548 0.0942201 -0.0000567 -0.000021 -0.000032 0.1941152 0.0398698 0.0041599 -0.0770535 -0.0105856 0.0596307 -0.0438019 -0.0826046 -0.0137781 -0.0056594 0.0512981 -0.1487451 -0.0000963 -0.0232579 -0.1358841 -0.0001685 -0.0000033 -0.0001722 0.1069751 0.039837 0.0040034 0.0770774 -0.0107276 0.0595177 0.0439098 0.0826262 0.0138731 -0.0056083 -0.0080365 -0.0356192 0.0000115 -0.0422224 0.0991206 -0.0000326 0.0000008 -0.0000378 0.1782197 unknown
polarizability: 122.3514098|-0.0169928|110.0554463|-0.0068164|0.0223473|39.9258324 unknown
InChI: InChI=1S/C7H6FNO2/c1-5-2-3-6(8)4-7(5)9(10)11/h2-4H,1H3
charge 0 multiplicity 1
17 atoms
F  -3.056055 1.336376 0.000839
O  1.80213 2.170569 -0.000239
O  2.85611 0.156853 0.000219
N  1.785387 0.878553 -0.00012
C  0.335763 -1.223857 -0.000806
C  0.458812 0.199241 -0.000193
C  -0.99342 -1.730926 -0.000873
C  -0.661227 1.065405 0.000337
C  1.48577 -2.211172 -0.001436
C  -2.131583 -0.900551 -0.000323
C  -1.934518 0.49182 0.00028
H  -1.132151 -2.816868 -0.001373
H  -0.516515 2.14794 0.000745
H  2.13995 -2.077112 0.87701
H  1.094051 -3.242164 -0.002189
H  2.140071 -2.075892 -0.879611
H  -3.143878 -1.314116 -0.000367
