program: Orca
programVersion: 5.0.2
elementType: O O O O N C C C C C C C C C C C C C C C C C C C H H H H H H H H H H H H H H H H H H H H H H H H H
charge: 0
multiplicity: 1
keywords: wb97x-d3
keywords: def2-TZVPP
keywords: def2/J RIJCOSX
keywords: DEFGRID2
keywords: scfconv7
keywords: smallprint printgap noloewdin
keywords: NOSOSCF
formula: C19H25NO4
InChI: InChI=1/C19H25NO4/c1-11(2)9-14-15(19(14,3)4)18(23)24-10-20-16(21)12-7-5-6-8-13(12)17(20)22/h9,14-15H,5-8,10H2,1-4H3
49 atoms
O  -0.43883 1.744399 1.036743
O  -0.670152 1.222922 -1.125973
O  1.951027 0.327714 2.498814
O  2.258845 1.943072 -1.740906
N  1.840117 1.415765 0.471707
C  -3.691387 0.96253 -0.299638
C  -3.087055 -0.404584 -0.388704
C  -2.39578 0.661055 0.438431
C  -3.692445 1.829837 -1.53362
C  -4.901265 1.183482 0.574543
C  -3.669193 -1.573457 0.304666
C  -1.107774 1.217443 0.000195
C  -4.076774 -2.709926 -0.269335
C  0.817418 2.36044 0.793114
C  -4.654648 -3.821173 0.55447
C  -4.022572 -2.988391 -1.740195
C  3.280938 -0.379292 0.600252
C  3.364768 0.097414 -0.642333
C  4.058846 -1.526696 1.127666
C  4.240006 -0.445007 -1.708885
C  5.204452 -1.849181 0.166323
C  4.75092 -1.825063 -1.292352
C  2.301779 0.443564 1.350623
C  2.44531 1.253789 -0.770403
H  -2.605266 -0.610532 -1.339118
H  -2.50186 0.570932 1.513831
H  -2.891532 1.591173 -2.229206
H  -4.635173 1.693754 -2.06677
H  -3.613959 2.886941 -1.272182
H  -4.981585 2.23552 0.853812
H  -5.812083 0.914292 0.036165
H  -4.873837 0.599946 1.493906
H  -3.77513 -1.484598 1.382129
H  1.060024 2.872007 1.720993
H  0.756304 3.098793 -0.005474
H  -4.663827 -3.584371 1.618144
H  -5.680596 -4.041745 0.248436
H  -4.087639 -4.745581 0.418203
H  -3.448957 -3.89673 -1.939906
H  -5.02784 -3.169855 -2.128906
H  -3.585356 -2.181928 -2.325591
H  4.439133 -1.303276 2.126912
H  3.394742 -2.389027 1.242538
H  3.699606 -0.496508 -2.65662
H  5.074718 0.243665 -1.873184
H  6.006957 -1.119812 0.307119
H  5.622235 -2.825883 0.412305
H  3.954854 -2.560747 -1.435906
H  5.573077 -2.1214 -1.944601
elementType: O N C H
totalener: -1094.87008374 hartree
nucrepener: 2089.96957579 hartree
electener: -3184.83965954 hartree
oneelecener: -5642.73531955 hartree
twoeener: 2457.89566002 hartree
cpcmener: -0.04096192 hartree
kineticenergy: 1090.04511950 hartree
xcener: -105.975462010099 hartree
chargesum: -0.0000000
charge: -0.286792 -0.491470 -0.435871 -0.430581 -0.101004 0.124868 0.038483 -0.140690 -0.283696 -0.265581 -0.285988 0.445844 -0.042926 0.080908 -0.220516 -0.253751 -0.081596 -0.065805 -0.071458 -0.076162 -0.137072 -0.134145 0.339147 0.337590 0.094870 0.090121 0.092604 0.096314 0.100995 0.098963 0.097249 0.089515 0.123308 0.147861 0.134263 0.089390 0.093902 0.093854 0.096262 0.097513 0.090602 0.093363 0.102386 0.093715 0.102435 0.078386 0.081214 0.078264 0.080915
qa: -0.2868 -0.4915 -0.4359 -0.4306 -0.1010 0.1249 0.0385 -0.1407 -0.2837 -0.2656 -0.2860 0.4458 -0.0429 0.0809 -0.2205 -0.2538 -0.0816 -0.0658 -0.0715 -0.0762 -0.1371 -0.1341 0.3391 0.3376 0.0949 0.0901 0.0926 0.0963 0.1010 0.0990 0.0972 0.0895 0.1233 0.1479 0.1343 0.0894 0.0939 0.0939 0.0963 0.0975 0.0906 0.0934 0.1024 0.0937 0.1024 0.0784 0.0812 0.0783 0.0809
va: 2.1131 2.0165 2.0744 2.0782 3.0868 3.6763 3.7639 3.8783 3.9042 3.9094 3.8695 4.1203 3.7427 3.8869 3.9209 3.9435 3.7039 3.6653 3.9175 3.9180 3.9174 3.9162 4.1888 4.1862 1.0300 1.0390 1.0185 1.0006 0.9989 1.0020 1.0025 1.0046 1.0083 0.9942 1.0155 1.0084 0.9962 0.9963 0.9973 0.9970 1.0091 1.0155 1.0044 1.0155 1.0041 1.0064 1.0092 1.0067 1.0092
dispcorr: -0.022577095 hartree
energy: -1094.892660836662
dipole: -20.76178 21.09104 0.32926 -18.04641 16.88779 -1.15861 -5.68126 6.03585 0.35459
magnitude: 1.25560 au
magnitude: 3.19148 debye
